{"text_format":"2","workbook":"xlsx","n_sheets":4,"sheets":["RV1106_Board","GX Board","Vat_tu_phu","Chi phí"],"not_rendered":{"charts":0,"images":1,"macros":0,"external_links":1,"defined_names":6,"comments":0,"pivot_tables":0},"unopened":[],"bounds":{"document_bytes":16777216,"sheet_cells":100000,"run_cost":"one","rows_first":2000,"rows_last":500,"rows_between":2000,"halvings":0,"cell_chars":16384,"cell_head_chars":4096},"cells_cut":0,"cells_raw":0,"read":"whole","date_system":"1900"}

{"sheet":"RV1106_Board","index":0,"n_rows":144,"n_cols":24,"rows_kept":144,"cut":false,"hidden":false,"merged":[[4,4,4,5],[4,6,4,7],[141,4,141,15],[142,4,142,15],[143,4,143,15],[3,0,3,1],[3,9,3,14],[0,0,1,2],[0,3,0,8],[0,9,0,13],[1,3,1,8],[1,9,1,13],[2,0,2,1],[2,9,2,14]]}
[null,null,null,{"$f":"UPPER(\"Bill of Materials\")","v":"BILL OF MATERIALS"},{"$nulls":5},"Rev:"]
[null,null,null,"Cambox_2026",{"$nulls":5},"Production QTY"]
["Customer:",null,"Aithings","HW version:","5.0",null,"Checked by:",null,null,"Date created:"]
["Board code:",null,"CameraBox","Prepared by:","Ducdv",null,"Approved by:",null,null,"08/05/2026"]
[{"$nulls":4},"Mã Hàng Hóa Ưu Tiên Mua",null,"Mã Hàng Hóa Tham Khảo"]
["STT","Internal Code","Category","Description","Manufacturer","Partnumber","Manufacturer 2","Manufacturer's Part Number 2","Designator","QTY / Set","Production quantity","Total Quantity","Unit","Mounting type","Note","EXW Price\n(USD)","Total EXW Price\n(USD)","Supplier","Việc cần làm"]
[1,null,"SOM","PCIE-RV1106 PCIE","RONGPIN","PCIE-RV1106 PCIE",null,null,"SOM",1,1000,{"$f":"J7*K7","v":1000},"pcs","SMD",null,24.5,{"$f":"P7*L7","v":24500},"Rongpin",{"$nulls":5},1]
[2,null,"IC","LTE CAT 1 module, 4G + (GNSS)","SIMCOM","A7677S",null,null,"U12",1,1000,{"$f":"J8*K8","v":1000},"pcs","SMD",null,{"$f":"VLOOKUP(F8,'[1]RV1106 board'!$F$7:$P$143,11,0)","v":4.5},{"$f":"P8*L8","v":4500},null,"Cần tối ưu giá",{"$nulls":4},1]
[3,null,"IC","GNSS Module with GPS, GLONASS, BDS, Galileo, QZSS, High Sensitivity, Low Power Consumption","SIMCom Wireless Solutions","SIM65M-C",null,null,"M2",1,1000,{"$f":"J9*K9","v":1000},"pcs","SMD",null,{"$f":"VLOOKUP(F9,'[1]RV1106 board'!$F$7:$P$143,11,0)","v":4.5},{"$f":"P9*L9","v":4500},null,"Cần tối ưu giá"]
[4,null,"PCB","PCB, 4 layer, 135.1 mm x 134.772 mm, PCB Thickness: 1,56mm, Material Type: FR-4 TG155","JLC",{"$nulls":4},1,1000,{"$f":"J10*K10","v":1000},"pcs","ASM",null,2,{"$f":"P10*L10","v":2000},null,"Cần tối ưu giá",{"$nulls":4},1]
[5,null,"IC","4Ch HD/SD Analog Video Decoder","CHIPUP","XS9922B",null,null,"U6",1,1000,{"$f":"J11*K11","v":1000},"pcs","ASM",null,{"$f":"VLOOKUP(F11,'[1]RV1106 board'!$F$7:$P$143,11,0)","v":1.5},{"$f":"P11*L11","v":1500},{"$f":"VLOOKUP(F11,'[1]RV1106 board'!$F$7:$R$143,13,0)","v":"Rongpin"},{"$nulls":5},1]
[6,null,"IC","Costoptimized high performance RX microcontroller with enhanced touch key function and 5V operation support.","Renesas Electronics","R5F51303ADFM",null,null,"U23",1,1000,{"$f":"J12*K12","v":1000},"pcs","SMD",null,{"$f":"VLOOKUP(F12,'[1]RV1106 board'!$F$7:$P$143,11,0)","v":1.1000000000000001},{"$f":"P12*L12","v":1100},{"$f":"VLOOKUP(F12,'[1]RV1106 board'!$F$7:$R$143,13,0)","v":"AVNET"},{"$nulls":5},1]
[7,null,"Connector","RJ45Receptacle 1 WithLED Plugin Ethernet Connectors / Modular Connectors (RJ45 RJ11) ROHS","HANRUN(Zhongshan HanRun Elec)","HR911105A",null,null,"J10",1,1000,{"$f":"J13*K13","v":1000},"pcs","TH",null,{"$f":"VLOOKUP(F13,'[1]RV1106 board'!$F$7:$P$143,11,0)","v":0.91469999999999996},{"$f":"P13*L13","v":914.69999999999993},{"$f":"VLOOKUP(F13,'[1]RV1106 board'!$F$7:$R$143,13,0)","v":"LCSC"},"Cần tối ưu giá",{"$nulls":4},"C3,C21"]
[8,null,"Connector","NANO SIM+TF /NANO SIM*2","MUP","M6110-01 & M6110-31",null,null,"J6",1,1000,{"$f":"J14*K14","v":1000},"pcs","SMD","Khe cắm và tray Sim",{"$f":"VLOOKUP(F14,'[1]RV1106 board'!$F$7:$P$143,11,0)","v":0.86},{"$f":"P14*L14","v":860},{"$f":"VLOOKUP(F14,'[1]RV1106 board'!$F$7:$R$143,13,0)","v":"MUP"},{"$nulls":5},"C4"]
[9,null,"IC","IC DRVR/RCVR MULTCH RS232 16SOIC","HGSEMI","SP3232AEIM/TR","Texas Instruments","MAX3232CDR","U11, U14, U15",3,1000,{"$f":"J15*K15","v":3000},"pcs","SMD",null,{"$f":"VLOOKUP(F15,'[1]RV1106 board'!$F$7:$P$143,11,0)","v":0.156},{"$f":"P15*L15","v":468},{"$f":"VLOOKUP(F15,'[1]RV1106 board'!$F$7:$R$143,13,0)","v":"LCSC"},{"$nulls":5},"C32,C191,C12,C34,C171,C104,C105,C192,C197,C5,58,56,60,61,62,72,73,74,75,76,77,79,82,"]
[10,null,"Inductor","3.3A 22uH ±20% 7A SMD,12.2x12.2mm Arrays, Signal Transformers RoHS","PULSE","PF0552.223NLT","Sumida","CDRCH12D78BNP-220MC","L3",1,1000,{"$f":"J16*K16","v":1000},"pcs","SMD",null,{"$f":"VLOOKUP(F16,'[1]RV1106 board'!$F$7:$P$143,11,0)","v":0.43290000000000001},{"$f":"P16*L16","v":432.90000000000003},{"$f":"VLOOKUP(F16,'[1]RV1106 board'!$F$7:$R$143,13,0)","v":"LCSC"},{"$nulls":5},"C31,C190,C8,C6"]
[11,null,"LED","60mA Red Lens 615nm~635nm -20℃~+85℃ Red 50° 150mW 1.8V~2.2V DIP-6-2.54mm LED Indication - Discrete ROHS","XINGLIGHT","XL-DZ304SURD/3",null,null,"LED1, LED2",2,1000,{"$f":"J17*K17","v":2000},"pcs","TH",null,{"$f":"VLOOKUP(F17,'[1]RV1106 board'!$F$7:$P$143,11,0)","v":0.20130000000000001},{"$f":"P17*L17","v":402.6},{"$f":"VLOOKUP(F17,'[1]RV1106 board'!$F$7:$R$143,13,0)","v":"LCSC"},{"$nulls":5},"C9,C25, C106, c193,c174,c194,c195, c175,C22"]
[12,null,"Capacitor","100uF ±20% 16V Ceramic Capacitor X5R 1210","Chinocera","HGC1210R5107M160NSVK","Taiyo Yuden","EMK325ABJ107MM-T","C140, C146",2,1000,{"$f":"J18*K18","v":2000},"pcs","SMD",null,{"$f":"VLOOKUP(F18,'[1]RV1106 board'!$F$7:$P$143,11,0)","v":0.188},{"$f":"P18*L18","v":376},{"$f":"VLOOKUP(F18,'[1]RV1106 board'!$F$7:$R$143,13,0)","v":"LCSC"},{"$nulls":5},1]
[13,null,"Connector","Card Connector NANO SIM Hinged Lid Surface Mount","MUP","C7802-02",null,null,"J23",1,1000,{"$f":"J19*K19","v":1000},"pcs","SMD",null,{"$f":"VLOOKUP(F19,'[1]RV1106 board'!$F$7:$P$143,11,0)","v":0.29220000000000002},{"$f":"P19*L19","v":292.2},{"$f":"VLOOKUP(F19,'[1]RV1106 board'!$F$7:$R$143,13,0)","v":"LCSC"},{"$nulls":5},1]
[14,null,"IC","1 Boost VSSOP-10-0.5mm DC DC Switching Controllers RoHS","Texas Instruments","LM3481MMX/NOPB",null,null,"U3",1,1000,{"$f":"J20*K20","v":1000},"pcs","SMD",null,{"$f":"VLOOKUP(F20,'[1]RV1106 board'!$F$7:$P$143,11,0)","v":0.28320000000000001},{"$f":"P20*L20","v":283.2},{"$f":"VLOOKUP(F20,'[1]RV1106 board'!$F$7:$R$143,13,0)","v":"LCSC"},{"$nulls":5},1]
[15,null,"IC","2.5MHz Buck Adjustable 800mV~28V 5A SOIC-8-EP Voltage Regulators - DC DC Switching Regulators RoHS","TI","LMR14050SDDAR",null,null,"U1",1,1000,{"$f":"J21*K21","v":1000},"pcs","SMD",null,{"$f":"VLOOKUP(F21,'[1]RV1106 board'!$F$7:$P$143,11,0)","v":0.26},{"$f":"P21*L21","v":260},{"$f":"VLOOKUP(F21,'[1]RV1106 board'!$F$7:$R$143,13,0)","v":"LCSC"},{"$nulls":5},"C15"]
[16,null,"IC","2.5A, 3MHz Switching Charger with Dynamic Power Path Management","etasolution","ETA6003Q3Q",null,null,"U22",1,1000,{"$f":"J22*K22","v":1000},"pcs","SMD",null,{"$f":"VLOOKUP(F22,'[1]RV1106 board'!$F$7:$P$143,11,0)","v":0.254},{"$f":"P22*L22","v":254},{"$f":"VLOOKUP(F22,'[1]RV1106 board'!$F$7:$R$143,13,0)","v":"LCSC"},{"$nulls":5},1]
[17,null,"MOSFET","100V 15A 49mΩ@10V,5A 2.8W 3.2V 1 N-Channel VSONP-8(3.1x3.1) MOSFETs ROHS","Texas Instruments","CSD19538Q3A",null,null,"Q3",1,1000,{"$f":"J23*K23","v":1000},"pcs","SMD",null,{"$f":"VLOOKUP(F23,'[1]RV1106 board'!$F$7:$P$143,11,0)","v":0.25159999999999999},{"$f":"P23*L23","v":251.6},{"$f":"VLOOKUP(F23,'[1]RV1106 board'!$F$7:$R$143,13,0)","v":"LCSC"},{"$nulls":5},"C179,C20"]
[18,null,"Heat Sinks","Heat Sinks 40.6×40.6×4.2mm","YG","YG-L40.6W40.6H4.2FPSY11",null,null,"H1",1,1000,{"$f":"J24*K24","v":1000},"pcs",null,"Heat Sinks ở version tiếp theo đổi sang mã YG-L40.6W40.6H4.2FPSY11",{"$f":"VLOOKUP(F24,'[1]RV1106 board'!$F$7:$P$143,11,0)","v":0.24110000000000001},{"$f":"P24*L24","v":241.10000000000002},{"$f":"VLOOKUP(F24,'[1]RV1106 board'!$F$7:$R$143,13,0)","v":"LCSC"},"Sourcing thêm NCC tản nhiệt, có thể hỏi GEMAY hoặc Kingreat",{"$nulls":4},1]
[19,null,"Connector","9P Male D-Sub Bend insert 2 3A -50℃~+105℃ Push-Pull D-Sub / VGA Connectors ROHS","Ckmtw(Shenzhen Cankemeng)","D-DMR009PM-D002",null,null,"J4",1,1000,{"$f":"J25*K25","v":1000},"pcs","TH",null,{"$f":"VLOOKUP(F25,'[1]RV1106 board'!$F$7:$P$143,11,0)","v":0.2298},{"$f":"P25*L25","v":229.8},{"$f":"VLOOKUP(F25,'[1]RV1106 board'!$F$7:$R$143,13,0)","v":"LCSC"},{"$nulls":5},1]
[20,null,"Connector","67P Surface Mount, Right Angle SMD,P=0.5mm,Surface Mount,Right Angle Centronics Connectors RoHS","FOXCONN","AS0BC21-S40BM-7H",null,null,"J28",1,1000,{"$f":"J26*K26","v":1000},"pcs","SMD",null,{"$f":"VLOOKUP(F26,'[1]RV1106 board'!$F$7:$P$143,11,0)","v":0.2273},{"$f":"P26*L26","v":227.3},{"$f":"VLOOKUP(F26,'[1]RV1106 board'!$F$7:$R$143,13,0)","v":"LCSC"},{"$nulls":5},1]
[21,null,"Connector","2mm 2mm 2 12P 2x6P -40℃~+105℃ 4.3mm Top 2A Square Hole Through Hole Through Hole,P=2mm Headers, Receptacles, Female Sockets RoHS","XFCN","PM200V-12-12-H43",null,null,"J14, J15, J16",3,1000,{"$f":"J27*K27","v":3000},"pcs","TH",null,{"$f":"VLOOKUP(F27,'[1]RV1106 board'!$F$7:$P$143,11,0)","v":7.4700000000000003E-2},{"$f":"P27*L27","v":224.1},{"$f":"VLOOKUP(F27,'[1]RV1106 board'!$F$7:$R$143,13,0)","v":"LCSC"},{"$nulls":5},1]
[22,null,"Capacitor","CAP CER 10uF 50V X5R 1206","FOJAN","FCC1206X106K500HT","AIDE CAPACITOR","C1206X5R106K500NT","C41, C10,  C18, C28, C30, C38, C16, C35, C45",{"$f":"1+8","v":9},1000,{"$f":"J28*K28","v":9000},"pcs","SMD","Đổi C10,  C18, C28, C30, C38, C16, C35, C45 từ 10uF/50V/X7R-1210 sang 10uF/50V/X5R-1206",{"$f":"VLOOKUP(F28,'[1]RV1106 board'!$F$7:$P$143,11,0)","v":2.3300000000000001E-2},{"$f":"P28*L28","v":209.70000000000002},{"$f":"VLOOKUP(F28,'[1]RV1106 board'!$F$7:$R$143,13,0)","v":"LCSC"},{"$nulls":5},1]
[23,null,"Capacitor","CAP CER 10uF 16V X5R 0805","Hottech","C0805X5R106K160NT",null,null,"C6, C8, C31, C55, C70, C71, C81, C83, C85, C90, C92, C95, C101, C107, C110, C112, C115, C117, C122, C123, C132, C136, C155, C185, C188, C190",26,1000,{"$f":"J29*K29","v":26000},"pcs","SMD",null,{"$f":"VLOOKUP(F29,'[1]RV1106 board'!$F$7:$P$143,11,0)","v":8.0000000000000002E-3},{"$f":"P29*L29","v":208},{"$f":"VLOOKUP(F29,'[1]RV1106 board'!$F$7:$R$143,13,0)","v":"LCSC"},{"$nulls":5},1]
[24,null,"Diode","275A 1 Independent 60V 620mV@7A 7A Power-DI-5 Single Diodes RoHS","FUXINSEMI","PDS760","DIODES","PDS760-13","D3",1,1000,{"$f":"J30*K30","v":1000},"pcs","SMD",null,{"$f":"VLOOKUP(F30,'[1]RV1106 board'!$F$7:$P$143,11,0)","v":0.1903},{"$f":"P30*L30","v":190.29999999999998},{"$f":"VLOOKUP(F30,'[1]RV1106 board'!$F$7:$R$143,13,0)","v":"LCSC"},{"$nulls":5},1]
[25,null,"Diode","DFN1006-2 TVS Diodes ROHS","Leiditech","LM-AZ6118-01F",null,null,"D2, D4, D42, D43",4,1000,{"$f":"J31*K31","v":4000},"pcs","SMD",null,{"$f":"VLOOKUP(F31,'[1]RV1106 board'!$F$7:$P$143,11,0)","v":4.65E-2},{"$f":"P31*L31","v":186},{"$f":"VLOOKUP(F31,'[1]RV1106 board'!$F$7:$R$143,13,0)","v":"LCSC"}]
[26,null,"Resistor","500mW Thin Film Resistor ±100ppm/℃ ±0.5% 15mΩ 1206 Chip Resistor - Surface Mount ROHS","Yageo","PE1206DRF7W0R015L",null,null,"R21",1,1000,{"$f":"J32*K32","v":1000},"pcs","SMD",null,0.1109,{"$f":"P32*L32","v":110.9},{"$f":"VLOOKUP(F32,'[1]RV1106 board'!$F$7:$R$143,13,0)","v":"LCSC"}]
[27,null,"IC","Buck 1MHz Adjustable 600mV~7.3V 3A SOT23-5 Voltage Regulators - DC DC Switching Regulators RoHS","etasolution","ETA3409S2F",null,null,"U2, U4, U7",3,1000,{"$f":"J33*K33","v":3000},"pcs","SMD",null,5.8999999999999997E-2,{"$f":"P33*L33","v":177},{"$f":"VLOOKUP(F33,'[1]RV1106 board'!$F$7:$R$143,13,0)","v":"LCSC"}]
[28,null,"MOSFET","SOT-23-3 MOSFETs P-Chanel ROHS","TECH PUBLIC","SI2333CDS",null,null,"Q20, Q35, Q36",3,1000,{"$f":"J34*K34","v":3000},"pcs","SMD",null,5.8000000000000003E-2,{"$f":"P34*L34","v":174},{"$f":"VLOOKUP(F34,'[1]RV1106 board'!$F$7:$R$143,13,0)","v":"LCSC"}]
[29,null,"Inductor","6A 6.8uH ±20% 39mΩ 10A SMD,7.1x6.6mm Fixed Inductors RoHS","PROD Tech","PSPMAA0605H-6R8M-ANP",null,null,"L2",1,1000,{"$f":"J35*K35","v":1000},"pcs","SMD",null,0.1007,{"$f":"P35*L35","v":100.7},{"$f":"VLOOKUP(F35,'[1]RV1106 board'!$F$7:$R$143,13,0)","v":"LCSC"}]
[30,null,"IC","500mA, low IQ, high precision, adjustable ultra-low dropout voltage regulator with enable function","TI","TLV75801PDBVR",null,null,"U5, U8, U9, U10",4,1000,{"$f":"J36*K36","v":4000},"pcs","SMD",null,4.1500000000000002E-2,{"$f":"P36*L36","v":166},{"$f":"VLOOKUP(F36,'[1]RV1106 board'!$F$7:$R$143,13,0)","v":"LCSC"}]
[31,null,"Connector","1 Inner pin IPEX Board-End 1.25mm -40℃~+90℃ 3GHz 50Ω 2mm SMD Coaxial Connectors (RF) ROHS","Shenzhen Kinghelm Elec","KH-IPEX-K501-29",null,null,"J5, J7, J9",3,1000,{"$f":"J37*K37","v":3000},"pcs","SMD",null,{"$f":"VLOOKUP(F37,'[1]RV1106 board'!$F$7:$P$143,11,0)","v":4.6699999999999998E-2},{"$f":"P37*L37","v":140.1},{"$f":"VLOOKUP(F37,'[1]RV1106 board'!$F$7:$R$143,13,0)","v":"LCSC"}]
[32,null,"Ferrite Bead","10mΩ ±25% 10Ω@100MHz 0603 Ferrite Beads and Chips RoHS","YJYCOIN","YI160808U100-5R0T",null,null,"E1, E2, E3, E4, E5, E16, E22, E29, E30, E31, E32",11,1000,{"$f":"J38*K38","v":11000},"pcs","SMD",null,1.24E-2,{"$f":"P38*L38","v":136.4},{"$f":"VLOOKUP(F38,'[1]RV1106 board'!$F$7:$R$143,13,0)","v":"LCSC"},{"$nulls":5},1]
[33,null,"MOSFET","N-Channel 30V 0.1A 0.35W Surface Mount SOT-23","JSCJ","2SK3018",null,null,"Q1, Q2, Q5, Q6, Q7, Q8, Q9, Q10, Q11, Q42",10,1000,{"$f":"J39*K39","v":10000},"pcs","SMD",null,1.2800000000000001E-2,{"$f":"P39*L39","v":128},{"$f":"VLOOKUP(F39,'[1]RV1106 board'!$F$7:$R$143,13,0)","v":"LCSC"},{"$nulls":5},"J5, J7, J9"]
[34,null,"Capacitor","16V 47uF X5R ±20% 1206 Multilayer Ceramic Capacitors MLCC - SMD/SMT ROHS","HRE","CGA1206X5R476M160NT","Taiyo Yuden","EMK316BBJ476ML-T","C20, C179",2,1000,{"$f":"J40*K40","v":2000},"pcs","SMD",null,{"$f":"VLOOKUP(F40,'[1]RV1106 board'!$F$7:$P$143,11,0)","v":5.9400000000000001E-2},{"$f":"P40*L40","v":118.8},{"$f":"VLOOKUP(F40,'[1]RV1106 board'!$F$7:$R$143,13,0)","v":"LCSC"},{"$nulls":5},1]
{"$rows_left_out":105}
{"sheet":"GX Board","index":1,"n_rows":21,"n_cols":19,"rows_kept":21,"cut":false,"hidden":false,"merged":[[20,4,20,15],[4,4,4,5],[4,6,4,7],[18,4,18,15],[19,4,19,15],[3,0,3,1],[3,9,3,14],[1,17,1,18],[2,17,2,18],[0,0,1,2],[0,3,0,8],[0,9,0,13],[1,3,1,8],[1,9,1,13],[2,0,2,1],[2,9,2,14]]}
[null,null,null,{"$f":"UPPER(\"Bill of Materials\")","v":"BILL OF MATERIALS"},{"$nulls":5},"Rev:"]
[null,null,null,"Camera_box_gx",{"$nulls":5},"Production QTY",{"$nulls":7},"BOM Export Date: 04/05/26 16:31:42"]
["Customer:",null,"Aithings","HW version:","5.0",null,"Checked by:",null,null,"Date created:",{"$nulls":7},"Website：https://www,lcsc,com/bom"]
["Board code:",null,"Camera_box_gx","Prepared by:","Ducdv",null,"Approved by:",null,null,"26/03/2026"]
[{"$nulls":4},"Mã Hàng Hóa Ưu Tiên Mua",null,"Mã Hàng Hóa Tham Khảo"]
["STT","Internal Code","Category","Description","Manufacturer","Partnumber","Manufacturer 2","Manufacturer's Part Number 2","Designator","QTY / Set","Production quantity","Total Quantity","Unit","Mounting type","Note","EXW Price\n(USD)","Total EXW Price\n(USD)","Supplier","Việc cần làm"]
[{"$f":"ROW(A7)-ROW($A$6)","v":1},null,"Capacitor","CAP CER 1UF 50V X5R 0603","FH","0603X105M500NT","Samsung Electro-Mechanics","CL10A105KB8NNNC","C1, C2, C3, C4",4,1000,{"$f":"J7*K7","v":4000},null,"SMD",null,{"$f":"VLOOKUP(F7,'[1]GX Board'!$F$7:$P$18,11,0)","v":4.5999999999999999E-3},{"$f":"P7*L7","v":18.399999999999999},"LCSC"]
[{"$f":"ROW(A8)-ROW($A$6)","v":2},null,"Connector","2x2P 4P Micro-Fit(MX 3,0) 3mm 2 2 3mm Direct Insert Plugin,P=3mm Wire To Board Connector ROHS","BOOMELE(Boom Precision Elec)","3.0-2*2A",null,null,"J7, J9, J10, J11, J12, J13",6,1000,{"$f":"J8*K8","v":6000},null,"SMD",null,{"$f":"VLOOKUP(F8,'[1]GX Board'!$F$7:$P$18,11,0)","v":4.4499999999999998E-2},{"$f":"P8*L8","v":267},"LCSC"]
[{"$f":"ROW(A9)-ROW($A$6)","v":3},null,"Connector","2x6P 12P Gold Brass -40℃~+105℃ Pin Header Black 2mm 2mm 250V 3A 2 2mm SMD,P=2mm Headers, Male Pins ROHS","XKB Connection","X4621WRS-2x06I-C40D64","XKB Connection","X4621WRS-2x03I-C40D64","J8, J14, J15",3,1000,3000,null,"SMD",null,{"$f":"VLOOKUP(F9,'[1]GX Board'!$F$7:$P$18,11,0)","v":0.18559999999999999},{"$f":"P9*L9","v":556.79999999999995},"LCSC"]
[{"$f":"ROW(A10)-ROW($A$6)","v":4},null,"MOSFET","SOT-23-3 MOSFETs P-Chanel ROHS","TECH PUBLIC","SI2333CDS",null,null,"Q1, Q2, Q5, Q6",4,1000,4000,null,"SMD",null,{"$f":"VLOOKUP(F10,'[1]GX Board'!$F$7:$P$18,11,0)","v":5.8000000000000003E-2},{"$f":"P10*L10","v":232},"LCSC"]
[{"$f":"ROW(A11)-ROW($A$6)","v":5},null,"Resistor","62,5mW Thick Film Resistor 50V ±100ppm/℃ ±1% 10kΩ 0402 Chip Resistor - Surface Mount ROHS","FOJAN","FRC0402F1002TS","Yageo","RC0402FR-0710KL","R1, R2, R7, R8",4,1000,4000,null,"SMD",null,{"$f":"VLOOKUP(F11,'[1]GX Board'!$F$7:$P$18,11,0)","v":4.0000000000000002E-4},{"$f":"P11*L11","v":1.6},"LCSC"]
[{"$f":"ROW(A12)-ROW($A$6)","v":6},null,"Resistor","62,5mW Thick Film Resistors 50V ±100ppm/℃ ±1% 4,7kΩ 0402 Chip Resistor - Surface Mount ROHS","FOJAN","FRC0402F4701TS","Yageo","RC0402FR-074K7L","R3, R4, R9, R10",4,1000,4000,null,"SMD",null,{"$f":"VLOOKUP(F12,'[1]GX Board'!$F$7:$P$18,11,0)","v":4.0000000000000002E-4},{"$f":"P12*L12","v":1.6},"LCSC"]
[{"$f":"ROW(A13)-ROW($A$6)","v":7},null,"Resistor","62,5mW Thick Film Resistor 50V ±100ppm/℃ ±1% 47kΩ 0402 Chip Resistor - Surface Mount ROHS","FOJAN","FRC0402F4702TS","Yageo","RC0402FR-0747KL","R5, R6, R11, R12",4,1000,4000,null,"SMD",null,{"$f":"VLOOKUP(F13,'[1]GX Board'!$F$7:$P$18,11,0)","v":4.0000000000000002E-4},{"$f":"P13*L13","v":1.6},"LCSC"]
[{"$f":"ROW(A14)-ROW($A$6)","v":8},null,"Transistor","TRANS NPN 60V 0,5A SOT23","TECH PUBLIC","TPMMBTA05","ON Semiconductor","MMBTA05LT1G","Q3, Q4, Q7, Q8",4,1000,4000,null,"SMD",null,{"$f":"VLOOKUP(F14,'[1]GX Board'!$F$7:$P$18,11,0)","v":1.7000000000000001E-2},{"$f":"P14*L14","v":68},"LCSC"]
[{"$f":"ROW(A15)-ROW($A$6)","v":9},null,"Connector","Giắc GX12-2P 2 Chân (Đực)","chxunda","XD-GX12-2P-F","LKTC","GX12-2P","J1",1,1000,1000,null,"TH",null,{"$f":"VLOOKUP(F15,'[1]GX Board'!$F$7:$P$18,11,0)","v":0.37269999999999998},{"$f":"P15*L15","v":372.7},"LCSC"]
[{"$f":"ROW(A16)-ROW($A$6)","v":10},null,"Connector","Giắc GX12-4P 12mm 4 Chân (Đực)","chxunda","XD-GX12-4P-M","LKTC","GX12-4P","J2, J3, J5, J6",4,1000,4000,null,"TH",null,{"$f":"VLOOKUP(F16,'[1]GX Board'!$F$7:$P$18,11,0)","v":0.38964705882352901},{"$f":"P16*L16","v":1558.588235294116},"LCSC"]
[{"$f":"ROW(A17)-ROW($A$6)","v":11},null,"PCB","PCB, 2 layer, 113,94 mm* 23,58 mm, PCB Thickness: 1,6mm, Gerber_Camerabox-gx_2025-11-24_Y2413","JLC","Y2413",null,null,null,1,1000,1000,null,"ASM",null,{"$f":"VLOOKUP(F17,'[1]GX Board'!$F$7:$P$18,11,0)","v":0.3},{"$f":"P17*L17","v":300},"LCSC"]
[{"$f":"ROW(A18)-ROW($A$6)","v":12},null,"Stencil",{"$nulls":6},1,1,1,null,"ASM",null,80,{"$f":"P18*L18","v":80},"LCSC"]
[{"$nulls":4},"TOTAL (USD):",{"$nulls":11},{"$f":"SUM(Q7:Q18)","v":3458.2882352941156}]
[{"$nulls":4},"EXW Price / Board (USD):",{"$nulls":11},{"$f":"Q19/1000","v":3.4582882352941158}]
[{"$nulls":4},"EXW Price / Board (VND):"]

{"sheet":"Vat_tu_phu","index":2,"n_rows":16,"n_cols":20,"rows_kept":16,"cut":false,"hidden":false,"merged":[[1,15,1,18],[3,0,3,1],[3,9,3,14],[0,0,1,2],[0,3,0,8],[0,9,0,13],[1,3,1,8],[1,9,1,13],[2,0,2,1],[2,9,2,14]]}
[null,null,null,{"$f":"UPPER(\"Bill of Materials\")","v":"BILL OF MATERIALS"},{"$nulls":5},"Rev:"]
[null,null,null,"Camera_box_vật tư phụ",{"$nulls":5},"Production QTY",{"$nulls":5},"Nguồn khác"]
["Customer:",null,"Aithings","HW version:","5.0",null,"Checked by:",null,null,"Date created:"]
["Board code:",null,"Vật tư phụ","Prepared by:","Ducdv",null,"Approved by:",null,null,"26/03/2026"]
["STT","Internal Code","Category","Description","Manufacture","Partnumber","Manufacturer 2","Manufacturer's Part Number 2","Designator","Quantity/kit","Board","Total","Unit","Mounting type","Note","Order Qty.","Unit Price(VND)","Ext,Price(VND)","Nguồn"]
[{"$f":"ROW(A6)-ROW($A$5)","v":1},null,"Battery","Pin Lithium","Shoppe: AM Linh Kiện",{"$nulls":4},1,10,{"$f":"J6*K6","v":10},null,"ASM",null,10,50000,{"$f":"Q6*P6","v":500000},"https://shopee.vn/product/472471748/27209001295?gads_t_sig=gqRjZGVrxHCFomtpsTE0MjUxOnRzc19zZGtfa2V5omt20QABpGFsZ2_SAAAAZKNkZWvAomN0xEAAAAAMRoz0ZUjQw0QlRa--FjB0AKnHQPF7xv4DyGj9-GQwqn4zSdB6gztmw7ebmtsZs9FPJxlVqctc57WUE3IRqmNpcGhlcnRleHTEbgAAAAzOmWiKQhTD73oy3pMTD74YwXKLY4RmTmx_PECgQdqrSMko9Yj-LV50FldCrrJu5kPHupxjQruBx93-Rht53dteckDz3PQ9R9Ffxg1CnUg0Q4ADNZT7dVO_ek6XNMjV98hEJY0-rMFUz31c&gad_source=1&gad_campaignid=22506035722&gbraid=0AAAAADPpQE6U2mKiUDG5SpqIjApCVJLCa&gclid=Cj0KCQjwh-HPBhCIARIsAC0p3ccvrmVkDpuOBH77KWqu0VKbvpR57SbJKexkpAHzM0uqhK1QMQfLJz4aAmzGEALw_wcB"]
[2,null,"BOX","Vỏ hộp ","Kadotech","KDT-2526",null,null,null,1,10,10,null,"ASM",null,"-",null,"-","Chưa tìm được nguồn mua phù hợp"]
[3,null,"Connector","Cáp RF Đầu SMA Cái Nối 1,13Ipex Dài 10cm","TGIC","1,13Ipex",null,null,null,2,10,20,null,"ASM",null,20,11970,{"$f":"Q8*P8","v":239400},"https://www.thegioiic.com/cap-rf-dau-sma-cai-noi-1-13ipex-dai-10cm"]
[4,null,"Product","Miếng dẫn nhiệt thermal pad 5W/mK cho vga, chipset, ic dày 0,5, 1, 1,5, 2, 2,5, 3, 5mm ,kienstore358","Shopee\nkienstore358","100x100x2mm",null,null,null,1,5,5,null,"ASM","Tản nhiệt SOM",3,46500,{"$f":"Q9*P9","v":139500},"https://shopee.vn/product/16195091/3632842107?gads_t_sig=gqRjZGVrxHCFomtpsTE0MjUxOnRzc19zZGtfa2V5omt20QABpGFsZ2_SAAAAZKNkZWvAomN0xEAAAAAMRoz0ZUjQw0QlRa--FjB0AKnHQPF7xv4DyGj9-GQwqn4zSdB6gztmw7ebmtsZs9FPJxlVqctc57WUE3IRqmNpcGhlcnRleHTEagAAAAxLgiQivYZgW5foBPUBW12V8NHF09EY7qvmQOS38IA2e0CYjRekDsolqv8LMehX3QA7bJdvA0ZGP-sAncSvKGxwbMeXwQx2NGhEZXdYRNYdiWPk82HQPWPYfVW33Sbu0RV7orG3wGk&gad_source=1&gad_campaignid=22496000355&gbraid=0AAAAADPpQE6bBolz_JwwPGJCnXnPJllEZ&gclid=Cj0KCQjwh-HPBhCIARIsAC0p3ccJjJk5KYxemJ07EzcLDLZYWXACEOCjEViEVKBJMcyI0qedliT716YaAkxiEALw_wcB"]
[5,null,"Quạt","Quạt Tản Nhiệt Mini 2510 – Quạt 2.5cm 25x25x10mm 5V / 12V DC – Gió Mạnh, Nhỏ Gọn, Ít Tiếng Ồn","SHOPPE","Mini Eibbkg 5V",null,null,null,1,10,10,null,"ASM",null,10,35000,{"$f":"Q10*P10","v":350000},"https://shopee.vn/Qu%EF%BF%BD%E1%BA%A1t-T%E1%BA%A3n-Nhi%E1%BB%87t-Mini-2510-%E2%80%93-Qu%E1%BA%A1t-2.5cm-25x25x10mm-5V-12V-DC-%E2%80%93-Gi%C3%B3-M%E1%BA%A1nh-Nh%E1%BB%8F-G%E1%BB%8Dn-%C3%8Dt-Ti%E1%BA%BFng-%E1%BB%92n-i.983524123.51300841631?extraParams=%7B%22display_model_id%22%3A445075556373%2C%22model_selection_logic%22%3A3%7D"]
[6,null,"Screw","10 cái M3 M4 M5 Bulong lục giác chìm đầu bằng đen thép mạ cấp bền 10,9 M3 M4 M5","Shopee Khôi Fasten","M3x16mm",null,null,null,4,10,40,null,"ASM","Vít cho quạt",50,{"$f":"35000/50","v":700},{"$f":"Q11*P11","v":35000},"https://shopee.vn/50-c%C3%A1i-M3-M4-M5-Bulong-l%E1%BB%A5c-gi%C3%A1c-ch%C3%ACm-%C4%91%E1%BA%A7u-b%E1%BA%B1ng-%C4%91en-th%C3%A9p-m%E1%BA%A1-c%E1%BA%A5p-b%E1%BB%81n-10.9-i.39096692.12657476490"]
[7,null,"Screw","Set 50, 20 Tán Dẹp Ecu Inox 304, thép thôi, thép mạ Cho ốc M3, M4, M5, M6, M8 Set 10 con đai ốc inox loại tốt","Linh kiện điện tử SMD","M3 Inox304",null,null,null,4,10,40,null,"ASM","Bulong hàn cho quạt",50,1600,{"$f":"Q12*P12","v":80000},"https://shopee.vn/product/134796651/18762050701?gads_t_sig=gqRjZGVrxHCFomtpsTE0MjUxOnRzc19zZGtfa2V5omt20QABpGFsZ2_SAAAAZKNkZWvAomN0xEAAAAAMRoz0ZUjQw0QlRa--FjB0AKnHQPF7xv4DyGj9-GQwqn4zSdB6gztmw7ebmtsZs9FPJxlVqctc57WUE3IRqmNpcGhlcnRleHTEbgAAAAyjVrs0gr8UnuryeetI3FX5Y16AmL_mbFh-BhzhNYSPCYip1w6WS6FoDljuqhTt2G5b1K_wR9XnDLR9WZzE5wC81X4yviPtEfAPixm0EH_uhDsW8r7vXboffenME-Yw3AOA9ysYlFQUXDIh&gad_source=1&gad_campaignid=22496000355&gbraid=0AAAAADPpQE6bBolz_JwwPGJCnXnPJllEZ&gclid=Cj0KCQjwh-HPBhCIARIsAC0p3cfnu3W1ldu4Fhpn7GV8qDwtxFhI1ARvfrlSmeh8cJ9jHKLEj-Gj6C4aAurrEALw_wcB"]
[8,null,"Screw","M1,2 M1,4 M1,6 M2 M2,5 M3 M4 M5 M6 Thép Carbon Kẽm Đen CM Cross Phillips Siêu Mỏng Siêu Thấp Đầu Phẳng Vít Bu Lông","Shopee huiruixin,vn","M1,4x2,5mm",null,null,null,1,10,10,null,"ASM","Vít cho SOM",500,null,52000,"https://shopee.vn/M1.2-M1.4-M1.6-M2-M2.5-M3-M4-M5-M6-Th%C3%A9p-Carbon-K%E1%BA%BDm-%C4%90en-CM-Cross-Phillips-Si%C3%AAu-M%E1%BB%8Fng-Si%C3%AAu-Th%E1%BA%A5p-%C4%90%E1%BA%A7u-Ph%E1%BA%B3ng-V%C3%ADt-Bu-L%C3%B4ng-i.889466159.28555773016?extraParams=%7B%22display_model_id%22%3A246227873566%2C%22model_selection_logic%22%3A3%7D"]
[9,null,"Screw","Bộ 10 Long đen/ vòng đệm các kích thước.M1.6 M2 M2.5 M3 M4 M6 M8 M10 M12 M14","Linh kiện điện tử SMD","M3",null,null,null,4,10,40,null,"ASM","Vênh cho quạt",40,null,20000,"https://shopee.vn/product/51517981/5019789812?gads_t_sig=gqRjZGVrxHCFomtpsTE0MjUxOnRzc19zZGtfa2V5omt20QABpGFsZ2_SAAAAZKNkZWvAomN0xEAAAAAMRoz0ZUjQw0QlRa--FjB0AKnHQPF7xv4DyGj9-GQwqn4zSdB6gztmw7ebmtsZs9FPJxlVqctc57WUE3IRqmNpcGhlcnRleHTEagAAAAyUnapXmxqrtAARC2f2cAyv2rWo4S6nSmJarRu2hF963X_eLnWICFmDLSksVdDtVkHlcvDes5vsZPttikVHhlfJAtwmGUBR9F0tm60UZ4rTVfZJAH2dWM_Bkpq7YSLuwi3vIB1wnUw&gad_source=1&gad_campaignid=22651004374&gbraid=0AAAAADPpQE6hA2b-beNyuq8-eNHxmjDX-&gclid=Cj0KCQjwh-HPBhCIARIsAC0p3ceXFYtQJC6HCGelD_ac7vc2P3AYvNRl1mFwCvvVQZLvehYiAS0tv8saAhFLEALw_wcB"]
[10,null,"Connector","Giắc GX12-2P 2 Chân (Cái) Đấu Dây Test","LKTC","GX12-2P (Cái)",null,null,null,1,10,10,null,"ASM",null,10,6200,{"$f":"Q15*P15","v":62000},"https://www.thegioiic.com/gx12-2p-dau-noi-tron-cai-2-chan-thang-hang-3a-125v"]
[null,null,null,"TỔNG",{"$nulls":13},{"$f":" SUM(R6:R15)","v":1477900},null,"VND"]

{"sheet":"Chi phí","index":3,"n_rows":4,"n_cols":8,"rows_kept":4,"cut":false,"hidden":false,"merged":[[1,6,3,6]]}
["STT","Loại","Số lượng","Đơn giá","Đơn vị","Quy đổi(VND)","Tổng tiền (VND)","Ghi chú"]
[1,"RV1106 Board",1,{"$f":"RV1106_Board!#REF!","v":{"$error":"#REF!"}},"USD",{"$f":"D2*26337","v":{"$error":"#REF!"}},{"$f":"F2+F3+F4","v":{"$error":"#REF!"}}]
[2,"Vat_tu_phu",1,{"$f":"Vat_tu_phu!R16","v":1477900},"VND",{"$f":"D3","v":1477900}]
[3,"GX_Board",1,{"$f":"'GX Board'!$R$19","v":0},"USD",{"$f":"D4*26337","v":0}]