{"text_format":"2","workbook":"xlsx","n_sheets":4,"sheets":["RV1106_Board","GX Board","Vat_tu_phu","Chi phí"],"not_rendered":{"charts":0,"images":1,"macros":0,"external_links":1,"defined_names":6,"comments":0,"pivot_tables":0},"unopened":[],"bounds":{"document_bytes":16777216,"sheet_cells":100000,"run_cost":"one","rows_first":2000,"rows_last":500,"rows_between":2000,"halvings":0,"cell_chars":16384,"cell_head_chars":4096},"cells_cut":0,"cells_raw":0,"read":"whole","date_system":"1900"}

{"sheet":"RV1106_Board","index":0,"n_rows":144,"n_cols":24,"rows_kept":144,"cut":false,"hidden":false,"merged":[[4,4,4,5],[4,6,4,7],[141,4,141,15],[142,4,142,15],[143,4,143,15],[3,0,3,1],[3,9,3,14],[0,0,1,2],[0,3,0,8],[0,9,0,13],[1,3,1,8],[1,9,1,13],[2,0,2,1],[2,9,2,14]]}
[null,null,null,{"$f":"UPPER(\"Bill of Materials\")","v":"BILL OF MATERIALS"},{"$nulls":5},"Rev:"]
[null,null,null,"Cambox_2026",{"$nulls":5},"Production QTY"]
["Customer:",null,"Aithings","HW version:","5.0",null,"Checked by:",null,null,"Date created:"]
["Board code:",null,"CameraBox","Prepared by:","Ducdv",null,"Approved by:",null,null,"08/05/2026"]
[{"$nulls":4},"Mã Hàng Hóa Ưu Tiên Mua",null,"Mã Hàng Hóa Tham Khảo"]
["STT","Internal Code","Category","Description","Manufacturer","Partnumber","Manufacturer 2","Manufacturer's Part Number 2","Designator","QTY / Set","Production quantity","Total Quantity","Unit","Mounting type","Note","EXW Price\n(USD)","Total EXW Price\n(USD)","Supplier","Việc cần làm"]
[1,null,"SOM","PCIE-RV1106 PCIE","RONGPIN","PCIE-RV1106 PCIE",null,null,"SOM",1,1000,{"$f":"J7*K7","v":1000},"pcs","SMD",null,24.5,{"$f":"P7*L7","v":24500},"Rongpin",{"$nulls":5},1]
[2,null,"IC","LTE CAT 1 module, 4G + (GNSS)","SIMCOM","A7677S",null,null,"U12",1,1000,{"$f":"J8*K8","v":1000},"pcs","SMD",null,{"$f":"VLOOKUP(F8,'[1]RV1106 board'!$F$7:$P$143,11,0)","v":4.5},{"$f":"P8*L8","v":4500},null,"Cần tối ưu giá",{"$nulls":4},1]
[3,null,"IC","GNSS Module with GPS, GLONASS, BDS, Galileo, QZSS, High Sensitivity, Low Power Consumption","SIMCom Wireless Solutions","SIM65M-C",null,null,"M2",1,1000,{"$f":"J9*K9","v":1000},"pcs","SMD",null,{"$f":"VLOOKUP(F9,'[1]RV1106 board'!$F$7:$P$143,11,0)","v":4.5},{"$f":"P9*L9","v":4500},null,"Cần tối ưu giá"]
[4,null,"PCB","PCB, 4 layer, 135.1 mm x 134.772 mm, PCB Thickness: 1,56mm, Material Type: FR-4 TG155","JLC",{"$nulls":4},1,1000,{"$f":"J10*K10","v":1000},"pcs","ASM",null,2,{"$f":"P10*L10","v":2000},null,"Cần tối ưu giá",{"$nulls":4},1]
[5,null,"IC","4Ch HD/SD Analog Video Decoder","CHIPUP","XS9922B",null,null,"U6",1,1000,{"$f":"J11*K11","v":1000},"pcs","ASM",null,{"$f":"VLOOKUP(F11,'[1]RV1106 board'!$F$7:$P$143,11,0)","v":1.5},{"$f":"P11*L11","v":1500},{"$f":"VLOOKUP(F11,'[1]RV1106 board'!$F$7:$R$143,13,0)","v":"Rongpin"},{"$nulls":5},1]
[6,null,"IC","Costoptimized high performance RX microcontroller with enhanced touch key function and 5V operation support.","Renesas Electronics","R5F51303ADFM",null,null,"U23",1,1000,{"$f":"J12*K12","v":1000},"pcs","SMD",null,{"$f":"VLOOKUP(F12,'[1]RV1106 board'!$F$7:$P$143,11,0)","v":1.1000000000000001},{"$f":"P12*L12","v":1100},{"$f":"VLOOKUP(F12,'[1]RV1106 board'!$F$7:$R$143,13,0)","v":"AVNET"},{"$nulls":5},1]
[7,null,"Connector","RJ45Receptacle 1 WithLED Plugin Ethernet Connectors / Modular Connectors (RJ45 RJ11) ROHS","HANRUN(Zhongshan HanRun Elec)","HR911105A",null,null,"J10",1,1000,{"$f":"J13*K13","v":1000},"pcs","TH",null,{"$f":"VLOOKUP(F13,'[1]RV1106 board'!$F$7:$P$143,11,0)","v":0.91469999999999996},{"$f":"P13*L13","v":914.69999999999993},{"$f":"VLOOKUP(F13,'[1]RV1106 board'!$F$7:$R$143,13,0)","v":"LCSC"},"Cần tối ưu giá",{"$nulls":4},"C3,C21"]
[8,null,"Connector","NANO SIM+TF /NANO SIM*2","MUP","M6110-01 & M6110-31",null,null,"J6",1,1000,{"$f":"J14*K14","v":1000},"pcs","SMD","Khe cắm và tray Sim",{"$f":"VLOOKUP(F14,'[1]RV1106 board'!$F$7:$P$143,11,0)","v":0.86},{"$f":"P14*L14","v":860},{"$f":"VLOOKUP(F14,'[1]RV1106 board'!$F$7:$R$143,13,0)","v":"MUP"},{"$nulls":5},"C4"]
[9,null,"IC","IC DRVR/RCVR MULTCH RS232 16SOIC","HGSEMI","SP3232AEIM/TR","Texas Instruments","MAX3232CDR","U11, U14, U15",3,1000,{"$f":"J15*K15","v":3000},"pcs","SMD",null,{"$f":"VLOOKUP(F15,'[1]RV1106 board'!$F$7:$P$143,11,0)","v":0.156},{"$f":"P15*L15","v":468},{"$f":"VLOOKUP(F15,'[1]RV1106 board'!$F$7:$R$143,13,0)","v":"LCSC"},{"$nulls":5},"C32,C191,C12,C34,C171,C104,C105,C192,C197,C5,58,56,60,61,62,72,73,74,75,76,77,79,82,"]
[10,null,"Inductor","3.3A 22uH ±20% 7A SMD,12.2x12.2mm Arrays, Signal Transformers RoHS","PULSE","PF0552.223NLT","Sumida","CDRCH12D78BNP-220MC","L3",1,1000,{"$f":"J16*K16","v":1000},"pcs","SMD",null,{"$f":"VLOOKUP(F16,'[1]RV1106 board'!$F$7:$P$143,11,0)","v":0.43290000000000001},{"$f":"P16*L16","v":432.90000000000003},{"$f":"VLOOKUP(F16,'[1]RV1106 board'!$F$7:$R$143,13,0)","v":"LCSC"},{"$nulls":5},"C31,C190,C8,C6"]
[11,null,"LED","60mA Red Lens 615nm~635nm -20℃~+85℃ Red 50° 150mW 1.8V~2.2V DIP-6-2.54mm LED Indication - Discrete ROHS","XINGLIGHT","XL-DZ304SURD/3",null,null,"LED1, LED2",2,1000,{"$f":"J17*K17","v":2000},"pcs","TH",null,{"$f":"VLOOKUP(F17,'[1]RV1106 board'!$F$7:$P$143,11,0)","v":0.20130000000000001},{"$f":"P17*L17","v":402.6},{"$f":"VLOOKUP(F17,'[1]RV1106 board'!$F$7:$R$143,13,0)","v":"LCSC"},{"$nulls":5},"C9,C25, C106, c193,c174,c194,c195, c175,C22"]
[12,null,"Capacitor","100uF ±20% 16V Ceramic Capacitor X5R 1210","Chinocera","HGC1210R5107M160NSVK","Taiyo Yuden","EMK325ABJ107MM-T","C140, C146",2,1000,{"$f":"J18*K18","v":2000},"pcs","SMD",null,{"$f":"VLOOKUP(F18,'[1]RV1106 board'!$F$7:$P$143,11,0)","v":0.188},{"$f":"P18*L18","v":376},{"$f":"VLOOKUP(F18,'[1]RV1106 board'!$F$7:$R$143,13,0)","v":"LCSC"},{"$nulls":5},1]
[13,null,"Connector","Card Connector NANO SIM Hinged Lid Surface Mount","MUP","C7802-02",null,null,"J23",1,1000,{"$f":"J19*K19","v":1000},"pcs","SMD",null,{"$f":"VLOOKUP(F19,'[1]RV1106 board'!$F$7:$P$143,11,0)","v":0.29220000000000002},{"$f":"P19*L19","v":292.2},{"$f":"VLOOKUP(F19,'[1]RV1106 board'!$F$7:$R$143,13,0)","v":"LCSC"},{"$nulls":5},1]
[14,null,"IC","1 Boost VSSOP-10-0.5mm DC DC Switching Controllers RoHS","Texas Instruments","LM3481MMX/NOPB",null,null,"U3",1,1000,{"$f":"J20*K20","v":1000},"pcs","SMD",null,{"$f":"VLOOKUP(F20,'[1]RV1106 board'!$F$7:$P$143,11,0)","v":0.28320000000000001},{"$f":"P20*L20","v":283.2},{"$f":"VLOOKUP(F20,'[1]RV1106 board'!$F$7:$R$143,13,0)","v":"LCSC"},{"$nulls":5},1]
[15,null,"IC","2.5MHz Buck Adjustable 800mV~28V 5A SOIC-8-EP Voltage Regulators - DC DC Switching Regulators RoHS","TI","LMR14050SDDAR",null,null,"U1",1,1000,{"$f":"J21*K21","v":1000},"pcs","SMD",null,{"$f":"VLOOKUP(F21,'[1]RV1106 board'!$F$7:$P$143,11,0)","v":0.26},{"$f":"P21*L21","v":260},{"$f":"VLOOKUP(F21,'[1]RV1106 board'!$F$7:$R$143,13,0)","v":"LCSC"},{"$nulls":5},"C15"]
[16,null,"IC","2.5A, 3MHz Switching Charger with Dynamic Power Path Management","etasolution","ETA6003Q3Q",null,null,"U22",1,1000,{"$f":"J22*K22","v":1000},"pcs","SMD",null,{"$f":"VLOOKUP(F22,'[1]RV1106 board'!$F$7:$P$143,11,0)","v":0.254},{"$f":"P22*L22","v":254},{"$f":"VLOOKUP(F22,'[1]RV1106 board'!$F$7:$R$143,13,0)","v":"LCSC"},{"$nulls":5},1]
[17,null,"MOSFET","100V 15A 49mΩ@10V,5A 2.8W 3.2V 1 N-Channel VSONP-8(3.1x3.1) MOSFETs ROHS","Texas Instruments","CSD19538Q3A",null,null,"Q3",1,1000,{"$f":"J23*K23","v":1000},"pcs","SMD",null,{"$f":"VLOOKUP(F23,'[1]RV1106 board'!$F$7:$P$143,11,0)","v":0.25159999999999999},{"$f":"P23*L23","v":251.6},{"$f":"VLOOKUP(F23,'[1]RV1106 board'!$F$7:$R$143,13,0)","v":"LCSC"},{"$nulls":5},"C179,C20"]
[18,null,"Heat Sinks","Heat Sinks 40.6×40.6×4.2mm","YG","YG-L40.6W40.6H4.2FPSY11",null,null,"H1",1,1000,{"$f":"J24*K24","v":1000},"pcs",null,"Heat Sinks ở version tiếp theo đổi sang mã YG-L40.6W40.6H4.2FPSY11",{"$f":"VLOOKUP(F24,'[1]RV1106 board'!$F$7:$P$143,11,0)","v":0.24110000000000001},{"$f":"P24*L24","v":241.10000000000002},{"$f":"VLOOKUP(F24,'[1]RV1106 board'!$F$7:$R$143,13,0)","v":"LCSC"},"Sourcing thêm NCC tản nhiệt, có thể hỏi GEMAY hoặc Kingreat",{"$nulls":4},1]
[19,null,"Connector","9P Male D-Sub Bend insert 2 3A -50℃~+105℃ Push-Pull D-Sub / VGA Connectors ROHS","Ckmtw(Shenzhen Cankemeng)","D-DMR009PM-D002",null,null,"J4",1,1000,{"$f":"J25*K25","v":1000},"pcs","TH",null,{"$f":"VLOOKUP(F25,'[1]RV1106 board'!$F$7:$P$143,11,0)","v":0.2298},{"$f":"P25*L25","v":229.8},{"$f":"VLOOKUP(F25,'[1]RV1106 board'!$F$7:$R$143,13,0)","v":"LCSC"},{"$nulls":5},1]
[20,null,"Connector","67P Surface Mount, Right Angle SMD,P=0.5mm,Surface Mount,Right Angle Centronics Connectors RoHS","FOXCONN","AS0BC21-S40BM-7H",null,null,"J28",1,1000,{"$f":"J26*K26","v":1000},"pcs","SMD",null,{"$f":"VLOOKUP(F26,'[1]RV1106 board'!$F$7:$P$143,11,0)","v":0.2273},{"$f":"P26*L26","v":227.3},{"$f":"VLOOKUP(F26,'[1]RV1106 board'!$F$7:$R$143,13,0)","v":"LCSC"},{"$nulls":5},1]
[21,null,"Connector","2mm 2mm 2 12P 2x6P -40℃~+105℃ 4.3mm Top 2A Square Hole Through Hole Through Hole,P=2mm Headers, Receptacles, Female Sockets RoHS","XFCN","PM200V-12-12-H43",null,null,"J14, J15, J16",3,1000,{"$f":"J27*K27","v":3000},"pcs","TH",null,{"$f":"VLOOKUP(F27,'[1]RV1106 board'!$F$7:$P$143,11,0)","v":7.4700000000000003E-2},{"$f":"P27*L27","v":224.1},{"$f":"VLOOKUP(F27,'[1]RV1106 board'!$F$7:$R$143,13,0)","v":"LCSC"},{"$nulls":5},1]
[22,null,"Capacitor","CAP CER 10uF 50V X5R 1206","FOJAN","FCC1206X106K500HT","AIDE CAPACITOR","C1206X5R106K500NT","C41, C10,  C18, C28, C30, C38, C16, C35, C45",{"$f":"1+8","v":9},1000,{"$f":"J28*K28","v":9000},"pcs","SMD","Đổi C10,  C18, C28, C30, C38, C16, C35, C45 từ 10uF/50V/X7R-1210 sang 10uF/50V/X5R-1206",{"$f":"VLOOKUP(F28,'[1]RV1106 board'!$F$7:$P$143,11,0)","v":2.3300000000000001E-2},{"$f":"P28*L28","v":209.70000000000002},{"$f":"VLOOKUP(F28,'[1]RV1106 board'!$F$7:$R$143,13,0)","v":"LCSC"},{"$nulls":5},1]
[23,null,"Capacitor","CAP CER 10uF 16V X5R 0805","Hottech","C0805X5R106K160NT",null,null,"C6, C8, C31, C55, C70, C71, C81, C83, C85, C90, C92, C95, C101, C107, C110, C112, C115, C117, C122, C123, C132, C136, C155, C185, C188, C190",26,1000,{"$f":"J29*K29","v":26000},"pcs","SMD",null,{"$f":"VLOOKUP(F29,'[1]RV1106 board'!$F$7:$P$143,11,0)","v":8.0000000000000002E-3},{"$f":"P29*L29","v":208},{"$f":"VLOOKUP(F29,'[1]RV1106 board'!$F$7:$R$143,13,0)","v":"LCSC"},{"$nulls":5},1]
[24,null,"Diode","275A 1 Independent 60V 620mV@7A 7A Power-DI-5 Single Diodes RoHS","FUXINSEMI","PDS760","DIODES","PDS760-13","D3",1,1000,{"$f":"J30*K30","v":1000},"pcs","SMD",null,{"$f":"VLOOKUP(F30,'[1]RV1106 board'!$F$7:$P$143,11,0)","v":0.1903},{"$f":"P30*L30","v":190.29999999999998},{"$f":"VLOOKUP(F30,'[1]RV1106 board'!$F$7:$R$143,13,0)","v":"LCSC"},{"$nulls":5},1]
[25,null,"Diode","DFN1006-2 TVS Diodes ROHS","Leiditech","LM-AZ6118-01F",null,null,"D2, D4, D42, D43",4,1000,{"$f":"J31*K31","v":4000},"pcs","SMD",null,{"$f":"VLOOKUP(F31,'[1]RV1106 board'!$F$7:$P$143,11,0)","v":4.65E-2},{"$f":"P31*L31","v":186},{"$f":"VLOOKUP(F31,'[1]RV1106 board'!$F$7:$R$143,13,0)","v":"LCSC"}]
[26,null,"Resistor","500mW Thin Film Resistor ±100ppm/℃ ±0.5% 15mΩ 1206 Chip Resistor - Surface Mount ROHS","Yageo","PE1206DRF7W0R015L",null,null,"R21",1,1000,{"$f":"J32*K32","v":1000},"pcs","SMD",null,0.1109,{"$f":"P32*L32","v":110.9},{"$f":"VLOOKUP(F32,'[1]RV1106 board'!$F$7:$R$143,13,0)","v":"LCSC"}]
[27,null,"IC","Buck 1MHz Adjustable 600mV~7.3V 3A SOT23-5 Voltage Regulators - DC DC Switching Regulators RoHS","etasolution","ETA3409S2F",null,null,"U2, U4, U7",3,1000,{"$f":"J33*K33","v":3000},"pcs","SMD",null,5.8999999999999997E-2,{"$f":"P33*L33","v":177},{"$f":"VLOOKUP(F33,'[1]RV1106 board'!$F$7:$R$143,13,0)","v":"LCSC"}]
[28,null,"MOSFET","SOT-23-3 MOSFETs P-Chanel ROHS","TECH PUBLIC","SI2333CDS",null,null,"Q20, Q35, Q36",3,1000,{"$f":"J34*K34","v":3000},"pcs","SMD",null,5.8000000000000003E-2,{"$f":"P34*L34","v":174},{"$f":"VLOOKUP(F34,'[1]RV1106 board'!$F$7:$R$143,13,0)","v":"LCSC"}]
[29,null,"Inductor","6A 6.8uH ±20% 39mΩ 10A SMD,7.1x6.6mm Fixed Inductors RoHS","PROD Tech","PSPMAA0605H-6R8M-ANP",null,null,"L2",1,1000,{"$f":"J35*K35","v":1000},"pcs","SMD",null,0.1007,{"$f":"P35*L35","v":100.7},{"$f":"VLOOKUP(F35,'[1]RV1106 board'!$F$7:$R$143,13,0)","v":"LCSC"}]
[30,null,"IC","500mA, low IQ, high precision, adjustable ultra-low dropout voltage regulator with enable function","TI","TLV75801PDBVR",null,null,"U5, U8, U9, U10",4,1000,{"$f":"J36*K36","v":4000},"pcs","SMD",null,4.1500000000000002E-2,{"$f":"P36*L36","v":166},{"$f":"VLOOKUP(F36,'[1]RV1106 board'!$F$7:$R$143,13,0)","v":"LCSC"}]
[31,null,"Connector","1 Inner pin IPEX Board-End 1.25mm -40℃~+90℃ 3GHz 50Ω 2mm SMD Coaxial Connectors (RF) ROHS","Shenzhen Kinghelm Elec","KH-IPEX-K501-29",null,null,"J5, J7, J9",3,1000,{"$f":"J37*K37","v":3000},"pcs","SMD",null,{"$f":"VLOOKUP(F37,'[1]RV1106 board'!$F$7:$P$143,11,0)","v":4.6699999999999998E-2},{"$f":"P37*L37","v":140.1},{"$f":"VLOOKUP(F37,'[1]RV1106 board'!$F$7:$R$143,13,0)","v":"LCSC"}]
[32,null,"Ferrite Bead","10mΩ ±25% 10Ω@100MHz 0603 Ferrite Beads and Chips RoHS","YJYCOIN","YI160808U100-5R0T",null,null,"E1, E2, E3, E4, E5, E16, E22, E29, E30, E31, E32",11,1000,{"$f":"J38*K38","v":11000},"pcs","SMD",null,1.24E-2,{"$f":"P38*L38","v":136.4},{"$f":"VLOOKUP(F38,'[1]RV1106 board'!$F$7:$R$143,13,0)","v":"LCSC"},{"$nulls":5},1]
[33,null,"MOSFET","N-Channel 30V 0.1A 0.35W Surface Mount SOT-23","JSCJ","2SK3018",null,null,"Q1, Q2, Q5, Q6, Q7, Q8, Q9, Q10, Q11, Q42",10,1000,{"$f":"J39*K39","v":10000},"pcs","SMD",null,1.2800000000000001E-2,{"$f":"P39*L39","v":128},{"$f":"VLOOKUP(F39,'[1]RV1106 board'!$F$7:$R$143,13,0)","v":"LCSC"},{"$nulls":5},"J5, J7, J9"]
[34,null,"Capacitor","16V 47uF X5R ±20% 1206 Multilayer Ceramic Capacitors MLCC - SMD/SMT ROHS","HRE","CGA1206X5R476M160NT","Taiyo Yuden","EMK316BBJ476ML-T","C20, C179",2,1000,{"$f":"J40*K40","v":2000},"pcs","SMD",null,{"$f":"VLOOKUP(F40,'[1]RV1106 board'!$F$7:$P$143,11,0)","v":5.9400000000000001E-2},{"$f":"P40*L40","v":118.8},{"$f":"VLOOKUP(F40,'[1]RV1106 board'!$F$7:$R$143,13,0)","v":"LCSC"},{"$nulls":5},1]
[35,null,"Speaker","85dB Active Buzzer (Built-in Driving Circuit) Electromagnetic 3kHz Through Hole,D=9mm Buzzers ROHS","Huaneng","HNB09A05",null,null,"BZ1",1,1000,{"$f":"J41*K41","v":1000},"pcs","TH",null,0.11609999999999999,{"$f":"P41*L41","v":116.1},{"$f":"VLOOKUP(F41,'[1]RV1106 board'!$F$7:$R$143,13,0)","v":"LCSC"},{"$nulls":5},1]
[36,null,"Ferrite Bead","FERRITE BEAD 1 KOHM 0805 1.5A","Sunlord","UPZ2012E102-1R5TF",null,null,"E6, E15, E26, E27, E28, E33",6,1000,{"$f":"J42*K42","v":6000},"pcs","SMD",null,7.6E-3,{"$f":"P42*L42","v":45.6},{"$f":"VLOOKUP(F42,'[1]RV1106 board'!$F$7:$R$143,13,0)","v":"LCSC"},{"$nulls":5},1]
[37,null,"Inductor","3.2A 2.2uH 5.8A 34mΩ ±20% SMD,4x4mm Fixed Inductors RoHS","ZE","ZNR3015ST2R2M",null,null,"L4, L5, L6",3,1000,{"$f":"J43*K43","v":3000},"pcs","SMD",null,1.78E-2,{"$f":"P43*L43","v":53.4},{"$f":"VLOOKUP(F43,'[1]RV1106 board'!$F$7:$R$143,13,0)","v":"LCSC"},{"$nulls":5},1]
[38,null,"Spacer","SMD SMT ROHS",null,"TH-0.8-0.5-M1.4",null,null,"H2",1,1000,{"$f":"J44*K44","v":1000},"pcs",null,"Spacer để giữ module SOM\nChưa có giá chính xác",0.1,{"$f":"P44*L44","v":100},"Rongpin","Hỏi Rongpin báo giá, đặt mua cùng với SOM PCIE-RV1106 PCIE",{"$nulls":4},"D2,D4"]
[39,null,"Inductor","8A 2.2uH ±20% 8.8A 12.5mΩ SMD,7x6.6mm Fixed Inductors RoHS","zoomdo electronics","ZD0650-2R2M",null,null,"L1",1,1000,{"$f":"J45*K45","v":1000},"pcs","SMD",null,5.5800000000000002E-2,{"$f":"P45*L45","v":55.800000000000004},{"$f":"VLOOKUP(F45,'[1]RV1106 board'!$F$7:$R$143,13,0)","v":"LCSC"},{"$nulls":5},1]
[40,null,"Transistor","TRANS NPN 40V 0.2A SOT23","TDSEMIC","MMBT3904-TD","Micro Commercial Co","MMBT3904-TP","Q4, Q12, Q16, Q17, Q19, Q21, Q23, Q24, Q25, Q26, Q27, Q28, Q29, Q30, Q31, Q32, Q33, Q34, Q37, Q38, Q39, Q41",22,1000,{"$f":"J46*K46","v":22000},"pcs","SMD",null,3.5000000000000001E-3,{"$f":"P46*L46","v":77},"LCSC",{"$nulls":5},1]
[41,null,"IC","SOT-26 ESD and Surge Protection (TVS/ESD) ROHS","Leiditech","SR05-04A",null,null,"U19",1,1000,{"$f":"J47*K47","v":1000},"pcs","SMD",null,5.0500000000000003E-2,{"$f":"P47*L47","v":50.5},{"$f":"VLOOKUP(F47,'[1]RV1106 board'!$F$7:$R$143,13,0)","v":"LCSC"}]
[42,null,"Diode","DIODE SCHOTTKY 60V 3A SMAF","HY","SS36F",null,null,"D54, D55",2,1000,{"$f":"J48*K48","v":2000},"pcs","SMD",null,{"$f":"VLOOKUP(F48,'[1]RV1106 board'!$F$7:$P$143,11,0)","v":"0.0338"},{"$f":"P48*L48","v":67.599999999999994},{"$f":"VLOOKUP(F48,'[1]RV1106 board'!$F$7:$R$143,13,0)","v":"LCSC"},{"$nulls":5},1]
[43,null,"Ferrite Bead","60Ω@100MHz 1 Line Ferrite Bead 0402 600mA 150mΩ","FH","CBW100505U600T",null,null,"E7, E8, E9, E10, E11, E12, E13, E14, E17, E18, E19, E20, E21",13,1000,{"$f":"J49*K49","v":13000},"pcs","SMD",null,{"$f":"VLOOKUP(F49,'[1]RV1106 board'!$F$7:$P$143,11,0)","v":"0.0050"},{"$f":"P49*L49","v":65},{"$f":"VLOOKUP(F49,'[1]RV1106 board'!$F$7:$R$143,13,0)","v":"LCSC"}]
[44,null,"Switch","Without bracket 50mA 3.5mm 100000 Times 260gf 12V 3mm 2mm Round Button Standing paste SPST SMD Tactile Switches ROHS","XUNPU","TS-1090S-AR02026",null,null,"K1",1,1000,{"$f":"J50*K50","v":1000},"pcs","SMD",null,{"$f":"VLOOKUP(F50,'[1]RV1106 board'!$F$7:$P$143,11,0)","v":"0.0637"},{"$f":"P50*L50","v":63.70000000000001},{"$f":"VLOOKUP(F50,'[1]RV1106 board'!$F$7:$R$143,13,0)","v":"LCSC"},{"$nulls":5},"D20"]
[45,null,"Diode","Independent Type 10A 1.1V@10A 1kV SMC(DO-214AB) Diodes - General Purpose ROHS","GOODWORK","S10M",null,null,"D52",1,1000,{"$f":"J51*K51","v":1000},"pcs","SMD",null,{"$f":"VLOOKUP(F51,'[1]RV1106 board'!$F$7:$P$143,11,0)","v":"0.0568"},{"$f":"P51*L51","v":56.800000000000004},{"$f":"VLOOKUP(F51,'[1]RV1106 board'!$F$7:$R$143,13,0)","v":"LCSC"}]
[46,null,"IC","2mV 25nA Dual channel SOIC-8 Comparators ROHS","Texas Instruments","LM393DR",null,null,"U21",1,1000,{"$f":"J52*K52","v":1000},"pcs","SMD",null,{"$f":"VLOOKUP(F52,'[1]RV1106 board'!$F$7:$P$143,11,0)","v":"0.0554"},{"$f":"P52*L52","v":55.4},{"$f":"VLOOKUP(F52,'[1]RV1106 board'!$F$7:$R$143,13,0)","v":"LCSC"},{"$nulls":5},1]
[47,null,"Diode","50V 5.5V 20V~35V 0402 Varistors, MOVs RoHS","R+O","HMLV0402-5R5E100","TDK","B72590D50H160","D9, D10, D12, D13, D23, D24, D25, D26, D27, D28, D29",11,1000,{"$f":"J53*K53","v":11000},"pcs","SMD",null,5.0000000000000001E-3,{"$f":"P53*L53","v":55},{"$f":"VLOOKUP(F53,'[1]RV1106 board'!$F$7:$R$143,13,0)","v":{"$error":"#N/A"}},{"$nulls":5},1]
[48,null,"MOSFET","MOSFET P-CH 30V 4.2A SOT-23","ASDsemi","ASDM3401ZA-R",null,null,"Q13",1,1000,{"$f":"J54*K54","v":1000},"pcs","SMD",null,{"$f":"VLOOKUP(F54,'[1]RV1106 board'!$F$7:$P$143,11,0)","v":"0.0526"},{"$f":"P54*L54","v":52.6},{"$f":"VLOOKUP(F54,'[1]RV1106 board'!$F$7:$R$143,13,0)","v":"LCSC"}]
[49,null,"IC","SOT-363-6 ESD and Surge Protection (TVS/ESD) ROHS","TECH PUBLIC","SMF05CT1G-P",null,null,"U18",1,1000,{"$f":"J55*K55","v":1000},"pcs","SMD",null,{"$f":"VLOOKUP(F55,'[1]RV1106 board'!$F$7:$P$143,11,0)","v":"0.0510"},{"$f":"P55*L55","v":51},{"$f":"VLOOKUP(F55,'[1]RV1106 board'!$F$7:$R$143,13,0)","v":"LCSC"},{"$nulls":5},"E1,E30,E2,E22,e4,e29,e5,e32,e31,e3"]
[50,null,"Diode","43.6A 9.2V 400W 6.4V Unidirectional 5V SOD-123 TVS Diodes RoHS","YTL","SMF5.0A","FUXINSEMI","PTVS5V0S1UR","D39, D40, D41, D44, D45",5,1000,{"$f":"J56*K56","v":5000},"pcs","SMD",null,9.7000000000000003E-3,{"$f":"P56*L56","v":48.5},"LCSC",{"$nulls":5},"E6,E33"]
[51,null,"Capacitor","16V 100nF X7R ±10% 0402 Multilayer Ceramic Capacitors MLCC - SMD/SMT ROHS","Yageo","CC0402KRX7R7BB104",null,null,"C5, C12, C32, C34, C42, C50, C51, C52, C54, C56, C58, C60, C61, C62, C63, C64, C65, C66, C67, C68, C69, C72, C73, C74, C75, C76, C77, C78, C79, C80, C82, C84, C86, C87, C88, C89, C91, C93, C94, C96, C97, C98, C99, C100, C103, C104, C105, C108, C111, C113, C116, C118, C119, C120, C121, C124, C125, C126, C127, C128, C129, C130, C131, C135, C137, C144, C145, C148, C160, C168, C171, C172, C173, C178, C186, C189, C191, C192, C197",79,1000,{"$f":"J57*K57","v":79000},"pcs","SMD",null,{"$f":"VLOOKUP(F57,'[1]RV1106 board'!$F$7:$P$143,11,0)","v":5.9999999999999995E-4},{"$f":"P57*L57","v":47.4},{"$f":"VLOOKUP(F57,'[1]RV1106 board'!$F$7:$R$143,13,0)","v":"LCSC"}]
[52,null,"Capacitor","10uF 100V 63mA@120Hz ±20% SMD,D6.3xL5.4mm Aluminum Electrolytic Capacitors - SMD ROHS","ROQANG","RVT2A100M0605",null,null,"C3, C21",2,1000,{"$f":"J58*K58","v":2000},"pcs","SMD",null,{"$f":"VLOOKUP(F58,'[1]RV1106 board'!$F$7:$P$143,11,0)","v":2.2599999999999999E-2},{"$f":"P58*L58","v":45.199999999999996},{"$f":"VLOOKUP(F58,'[1]RV1106 board'!$F$7:$R$143,13,0)","v":"LCSC"},{"$nulls":5},1]
[53,null,"Inductor","90Ω@100MHz 5Ω 2 SMD-4P,0.8x0.6mm Common Mode Filters ROHS","Murata Electronics","DLM0NSN900HY2D",null,null,"L10",1,1000,{"$f":"J59*K59","v":1000},"pcs","SMD",null,{"$f":"VLOOKUP(F59,'[1]RV1106 board'!$F$7:$P$143,11,0)","v":"0.0431"},{"$f":"P59*L59","v":43.1},{"$f":"VLOOKUP(F59,'[1]RV1106 board'!$F$7:$R$143,13,0)","v":"LCSC"},{"$nulls":5},"U2,U7,U4"]
[54,null,"LED","20mA 180mcd Colorless Transparent Lens 565nm~575nm -20℃~+85℃ Positive Stick Yellow-green 120° 50mW 2.4V 0603 LED Indication - Discrete ROH","XINGLIGHT","XL-1608SYGC-04",null,null,"D1, D21, D32, D36, D56",5,1000,{"$f":"J60*K60","v":5000},"pcs","SMD",null,{"$f":"VLOOKUP(F60,'[1]RV1106 board'!$F$7:$P$143,11,0)","v":"0.0084"},{"$f":"P60*L60","v":42},{"$f":"VLOOKUP(F60,'[1]RV1106 board'!$F$7:$R$143,13,0)","v":"LCSC"},{"$nulls":5},1]
[55,null,"Capacitor","100V 2.2uF X7R ±10% 1206 Multilayer Ceramic Capacitors MLCC - SMD/SMT ROHS","CCTC","TCC1206X7R225K101HT",null,null,"C1",1,1000,{"$f":"J61*K61","v":1000},"pcs","SMD","Mã cũ: CCTC TCC1206X7R225K101HT",{"$f":"VLOOKUP(F61,'[1]RV1106 board'!$F$7:$P$143,11,0)","v":3.85E-2},{"$f":"P61*L61","v":38.5},{"$f":"VLOOKUP(F61,'[1]RV1106 board'!$F$7:$R$143,13,0)","v":"LCSC"},{"$nulls":5},"U5,U8,U9,U10"]
[56,null,"Thermistor","10kΩ ±1% 310uA 3435K 100mW ±1% 0603 NTC Thermistors ROHS","Nanjing Shiheng Elec","CMFA 103F3435",null,null,"R236",1,1000,{"$f":"J62*K62","v":1000},"pcs","SMD",null,{"$f":"VLOOKUP(F62,'[1]RV1106 board'!$F$7:$P$143,11,0)","v":"0.0378"},{"$f":"P62*L62","v":37.799999999999997},{"$f":"VLOOKUP(F62,'[1]RV1106 board'!$F$7:$R$143,13,0)","v":"LCSC"},{"$nulls":5},"U11, U14, U15"]
[57,null,"Inductor","2A 2.2uH Magnetic Shielded Inductor ±20% 2A 60mΩ SMD,3x3mm Fixed Inductors RoHS","ZE","ZNR3015ST2R2M",null,null,"L7",1,1000,{"$f":"J63*K63","v":1000},"pcs","SMD",null,{"$f":"VLOOKUP(F63,'[1]RV1106 board'!$F$7:$P$143,11,0)","v":"0.0371"},{"$f":"P63*L63","v":37.1},{"$f":"VLOOKUP(F63,'[1]RV1106 board'!$F$7:$R$143,13,0)","v":"LCSC"},{"$nulls":5},1]
[58,null,"Crystal","Crystal 27MHz 10ppm 20pF 60Ω SMD2016-4P","MDH","2.D.1.270002002",null,null,"X1",1,1000,{"$f":"J64*K64","v":1000},"pcs","SMD",null,{"$f":"VLOOKUP(F64,'[1]RV1106 board'!$F$7:$P$143,11,0)","v":3.3300000000000003E-2},{"$f":"P64*L64","v":33.300000000000004},{"$f":"VLOOKUP(F64,'[1]RV1106 board'!$F$7:$R$143,13,0)","v":"LCSC"},{"$nulls":5},1]
[59,null,"Capacitor","470uF ±20% 16V Aluminum Electrolytic Capacitors 2000hrs@105℃","ROQANG","RVT1C471M0810",null,null,"C13",1,1000,{"$f":"J65*K65","v":1000},"pcs","SMD",null,{"$f":"VLOOKUP(F65,'[1]RV1106 board'!$F$7:$P$143,11,0)","v":3.3000000000000002E-2},{"$f":"P65*L65","v":33},{"$f":"VLOOKUP(F65,'[1]RV1106 board'!$F$7:$R$143,13,0)","v":"LCSC"},{"$nulls":5},1]
[60,null,"Resistor","62.5mW Thick Film Resistor 50V ±100ppm/℃ ±1% 10kΩ 0402 Chip Resistor - Surface Mount ROHS","Yageo","RC0402FR-0710KL",null,null,"R6, R13, R16, R17, R18, R25, R31, R33, R34, R35, R36, R39, R49, R100, R113, R115, R116, R120, R140, R142, R147, R155, R164, R165, R185, R186, R187, R191, R192, R193, R194, R195, R198, R199, R201, R202, R205, R234, R250, R257",40,1000,{"$f":"J66*K66","v":40000},"pcs","SMD",null,{"$f":"VLOOKUP(F66,'[1]RV1106 board'!$F$7:$P$143,11,0)","v":"0.0008"},{"$f":"P66*L66","v":32},{"$f":"VLOOKUP(F66,'[1]RV1106 board'!$F$7:$R$143,13,0)","v":"LCSC"},{"$nulls":5},1]
[61,null,"Capacitor","100uF 50V 146mA@120Hz ±20% SMD,D8xL10.2mm Aluminum Electrolytic Capacitors - SMD ROHS","ROQANG","RT1H101M0810",null,null,"C40",1,1000,{"$f":"J67*K67","v":1000},"pcs","SMD",null,{"$f":"VLOOKUP(F67,'[1]RV1106 board'!$F$7:$P$143,11,0)","v":3.1800000000000002E-2},{"$f":"P67*L67","v":31.8},{"$f":"VLOOKUP(F67,'[1]RV1106 board'!$F$7:$R$143,13,0)","v":"LCSC"},{"$nulls":5},1]
[62,null,"Capacitor","CAP CER 1UF 50V X5R 0603","CCTC","TCC0603X5R105M500CT","Samsung Electro-Mechanics","CL10A105KB8NNNC","C15, C48, C49, C57, C59, C139, C170",7,1000,{"$f":"J68*K68","v":7000},"pcs","SMD",null,{"$f":"VLOOKUP(F68,'[1]RV1106 board'!$F$7:$P$143,11,0)","v":4.1000000000000003E-3},{"$f":"P68*L68","v":28.700000000000003},{"$f":"VLOOKUP(F68,'[1]RV1106 board'!$F$7:$R$143,13,0)","v":"LCSC"},{"$nulls":5},1]
[63,null,"Diode","3A@8/20us 23V 70W@8/20us 6V 5V DFN1006-2L TVS Diodes RoHS","Wayon","WE05DGCF-B",null,null,"D7, D35",2,1000,{"$f":"J69*K69","v":2000},"pcs","SMD",null,{"$f":"VLOOKUP(F69,'[1]RV1106 board'!$F$7:$P$143,11,0)","v":"0.0143"},{"$f":"P69*L69","v":28.6},{"$f":"VLOOKUP(F69,'[1]RV1106 board'!$F$7:$R$143,13,0)","v":"LCSC"},{"$nulls":5},1]
[64,null,"Diode","Unidirectional 36V 40V 58.1V 3.4A SOD-123FL TVS RoHS","MDD(Microdiode Semiconductor)","SMF36A",null,null,"D53",1,1000,{"$f":"J70*K70","v":1000},"pcs","SMD",null,{"$f":"VLOOKUP(F70,'[1]RV1106 board'!$F$7:$P$143,11,0)","v":"0.0286"},{"$f":"P70*L70","v":28.6},{"$f":"VLOOKUP(F70,'[1]RV1106 board'!$F$7:$R$143,13,0)","v":"LCSC"},{"$nulls":5},1]
[65,null,"Diode","40V Independent 500mV@3A 3A SMA(DO-214AC) Schottky Diodes ROHS","Guangdong Hottech","SS34A",null,null,"D6",1,1000,{"$f":"J71*K71","v":1000},"pcs","SMD",null,{"$f":"VLOOKUP(F71,'[1]RV1106 board'!$F$7:$P$143,11,0)","v":2.58E-2},{"$f":"P71*L71","v":25.8},{"$f":"VLOOKUP(F71,'[1]RV1106 board'!$F$7:$R$143,13,0)","v":"LCSC"},{"$nulls":5},"L4,L5,L6"]
[66,null,"Capacitor","50V 100nF X7R ±10% 0603 Multilayer Ceramic Capacitors MLCC - SMD/SMT ROHS","Yageo","CC0603KRX7R9BB104",null,null,"C9, C22, C25, C36, C102, C106, C156, C158, C174, C175, C176, C193, C194, C195",14,1000,{"$f":"J72*K72","v":14000},"pcs","SMD",null,{"$f":"VLOOKUP(F72,'[1]RV1106 board'!$F$7:$P$143,11,0)","v":1.6999999999999999E-3},{"$f":"P72*L72","v":23.799999999999997},{"$f":"VLOOKUP(F72,'[1]RV1106 board'!$F$7:$R$143,13,0)","v":"LCSC"}]
[67,null,"Diode","Unidirectional 5V (Max) 6.2V 18.6V 9.4A SOD-523 TVS RoHs","Tak cheong","ESD5Z5V0",null,null,"D5, D19, D30",3,1000,{"$f":"J73*K73","v":3000},"pcs","SMD",null,{"$f":"VLOOKUP(F73,'[1]RV1106 board'!$F$7:$P$143,11,0)","v":7.9000000000000008E-3},{"$f":"P73*L73","v":23.700000000000003},{"$f":"VLOOKUP(F73,'[1]RV1106 board'!$F$7:$R$143,13,0)","v":"LCSC"}]
[68,null,"Capacitor","100V 100nF X7R ±10% 1206 Multilayer Ceramic Capacitors MLCC - SMD/SMT ROHS","Yageo","CC1206KKX7R0BB104",null,null,"C2, C19",2,1000,{"$f":"J74*K74","v":2000},"pcs","SMD",null,{"$f":"VLOOKUP(F74,'[1]RV1106 board'!$F$7:$P$143,11,0)","v":1.1599999999999999E-2},{"$f":"P74*L74","v":23.2},{"$f":"VLOOKUP(F74,'[1]RV1106 board'!$F$7:$R$143,13,0)","v":"LCSC"}]
[69,null,"Capacitor","4.7uF 35V ±10% 0603 Multilayer Ceramic Capacitors MLCC - SMD/SMT ROHS","AIDE CAPACITOR","C0603X5R475K350NT",null,null,"C157",1,1000,{"$f":"J75*K75","v":1000},"pcs","SMD",null,{"$f":"VLOOKUP(F75,'[1]RV1106 board'!$F$7:$P$143,11,0)","v":2.1100000000000001E-2},{"$f":"P75*L75","v":21.1},{"$f":"VLOOKUP(F75,'[1]RV1106 board'!$F$7:$R$143,13,0)","v":"LCSC"}]
[70,null,"Capacitor","C0G 33pF 50V ±5% 0402 Multilayer Ceramic Capacitors MLCC - SMD/SMT ROHS","Samsung Electro-Mechanics","CL05C330JB5NNNC",null,null,"C46, C47, C149, C150, C151, C159, C7, C141",{"$f":"6 + 2","v":8},1000,{"$f":"J76*K76","v":8000},"pcs","SMD","Đổi C7 từ 33pF/0603 sang 33pF/0402\nĐổi C141 từ 33pF/0805 sang 33pF/0402",{"$f":"VLOOKUP(F76,'[1]RV1106 board'!$F$7:$P$143,11,0)","v":2.3999999999999998E-3},{"$f":"P76*L76","v":19.2},{"$f":"VLOOKUP(F76,'[1]RV1106 board'!$F$7:$R$143,13,0)","v":"LCSC"},{"$nulls":5},"D1"]
[71,null,"Resistor","62.5mW Thick Film Resistors 50V ±100ppm/℃ ±1% 4.7kΩ 0402 Chip Resistor - Surface Mount ROHS","Yageo","RC0402FR-074K7L",null,null,"R37, R38, R45, R64, R73, R80, R96, R97, R103, R134, R135, R141, R144, R148, R206, R211, R213, R218, R220, R221, R244, R251, R254, R260",24,1000,{"$f":"J77*K77","v":24000},"pcs","SMD",null,{"$f":"VLOOKUP(F77,'[1]RV1106 board'!$F$7:$P$143,11,0)","v":"0.0008"},{"$f":"P77*L77","v":19.2},{"$f":"VLOOKUP(F77,'[1]RV1106 board'!$F$7:$R$143,13,0)","v":"LCSC"}]
[72,null,"MOSFET","50V 200mA 225mW 5.6Ω@2.75V,200mA 500mV 1 N-channel SOT-23 MOSFETs ROHS","LRC","LBSS139LT1G",null,null,"Q22",1,1000,{"$f":"J78*K78","v":1000},"pcs","SMD",null,{"$f":"VLOOKUP(F78,'[1]RV1106 board'!$F$7:$P$143,11,0)","v":"0.0189"},{"$f":"P78*L78","v":18.899999999999999},{"$f":"VLOOKUP(F78,'[1]RV1106 board'!$F$7:$R$143,13,0)","v":"LCSC"}]
[73,null,"Resistor","62.5mW Thick Film Resistor 50V ±1% ±200ppm/℃ 10Ω 0402 Chip Resistor - Surface Mount ROHS","Yageo","RC0402FR-0710RL",null,null,"R77, R81, R82, R85, R87, R88, R91, R92, R151, R253",10,1000,{"$f":"J79*K79","v":10000},"pcs","SMD",null,{"$f":"VLOOKUP(F79,'[1]RV1106 board'!$F$7:$P$143,11,0)","v":"0.0018"},{"$f":"P79*L79","v":18},{"$f":"VLOOKUP(F79,'[1]RV1106 board'!$F$7:$R$143,13,0)","v":"LCSC"},{"$nulls":5},1]
[74,null,"Diode","DIODE ZENER 5.1V 500MW SOD123","\tDiodes Incorporated","MMSZ5231B-7-F",null,null,"D8",1,1000,{"$f":"J80*K80","v":1000},"pcs","SMD",null,{"$f":"VLOOKUP(F80,'[1]RV1106 board'!$F$7:$P$143,11,0)","v":"0.0179"},{"$f":"P80*L80","v":17.899999999999999},{"$f":"VLOOKUP(F80,'[1]RV1106 board'!$F$7:$R$143,13,0)","v":"LCSC"},{"$nulls":5},1]
[75,null,"Diode","DIODE GEN PURP 1KV 1A SMA","TDSEMIC","1N4007 M7",null,null,"D20, D47, D48",3,1000,{"$f":"J81*K81","v":3000},"pcs","SMD",null,{"$f":"VLOOKUP(F81,'[1]RV1106 board'!$F$7:$P$143,11,0)","v":5.8999999999999999E-3},{"$f":"P81*L81","v":17.7},{"$f":"VLOOKUP(F81,'[1]RV1106 board'!$F$7:$R$143,13,0)","v":"LCSC"},{"$nulls":5},"Q5,Q6,Q7,Q8,Q9,Q10,Q11,Q1,Q2,Q42"]
[76,null,"Resistor","62.5mW Thick Film Resistor 50V ±100ppm/℃ ±1% 1kΩ 0402 Chip Resistor - Surface Mount ROHS","Yageo","RC0402FR-071KL",null,null,"R9, R53, R78, R83, R86, R90, R94, R95, R102, R111, R112, R149, R156, R188, R189, R190, R196, R204, R233, R249, R256, R263",22,1000,{"$f":"J82*K82","v":22000},"pcs","SMD",null,{"$f":"VLOOKUP(F82,'[1]RV1106 board'!$F$7:$P$143,11,0)","v":"0.0008"},{"$f":"P82*L82","v":17.600000000000001},{"$f":"VLOOKUP(F82,'[1]RV1106 board'!$F$7:$R$143,13,0)","v":"LCSC"},{"$nulls":5},1]
[77,null,"Capacitor","50V 100pF NP0 ±1% 0402 Multilayer Ceramic Capacitors MLCC - SMD/SMT ROHS","Yageo","CC0402FRNPO9BN101",null,null,"C44, C133, C143, C161, C162, C166, C167, C169",8,1000,{"$f":"J83*K83","v":8000},"pcs","SMD",null,{"$f":"VLOOKUP(F83,'[1]RV1106 board'!$F$7:$P$143,11,0)","v":2.0999999999999999E-3},{"$f":"P83*L83","v":16.8},{"$f":"VLOOKUP(F83,'[1]RV1106 board'!$F$7:$R$143,13,0)","v":"LCSC"},{"$nulls":5},1]
[78,null,"Resistor","62.5mW Thick Film Resistor 50V ±100ppm/℃ ±1% 2.2kΩ 0402 Chip Resistor - Surface Mount ROHS","Yageo","RC0402FR-072K2L",null,null,"R32, R51, R52, R63, R71, R72, R76, R129, R130, R131, R208, R209, R210, R215, R216, R217, R255, R259",18,1000,{"$f":"J84*K84","v":18000},"pcs","SMD",null,{"$f":"VLOOKUP(F84,'[1]RV1106 board'!$F$7:$P$143,11,0)","v":"0.0009"},{"$f":"P84*L84","v":16.2},{"$f":"VLOOKUP(F84,'[1]RV1106 board'!$F$7:$R$143,13,0)","v":"LCSC"}]
[79,null,"Resistor","62.5mW 0Ω 50V ±1% Thick Film Resistors 0402 Chip Resistor - Surface Mount ROHS","Yageo","RC0402FR-070RL",null,null,"R56, R57, R58, R59, R61, R65, R66, R67, R68, R70, R74, R75, R98, R99, R119, R138, R154, R157, R246, R247",20,1000,{"$f":"J85*K85","v":20000},"pcs","SMD",null,{"$f":"VLOOKUP(F85,'[1]RV1106 board'!$F$7:$P$143,11,0)","v":"0.0008"},{"$f":"P85*L85","v":16},{"$f":"VLOOKUP(F85,'[1]RV1106 board'!$F$7:$R$143,13,0)","v":"LCSC"}]
[80,null,"Connector","XH Header Male Pin 0.098\"(2.50mm) 2 Through Hole Wire To Board / Wire To Wire Connector RoHS","BOOMELE(Boom Precision Elec)","XH-2AW",null,null,"J17",1,1000,{"$f":"J86*K86","v":1000},"pcs","TH",null,{"$f":"VLOOKUP(F86,'[1]RV1106 board'!$F$7:$P$143,11,0)","v":"0.0130"},{"$f":"P86*L86","v":13},{"$f":"VLOOKUP(F86,'[1]RV1106 board'!$F$7:$R$143,13,0)","v":"LCSC"},{"$nulls":5},1]
[81,null,"Resistor","62.5mW Thick Film Resistor 50V ±100ppm/℃ ±1% 47kΩ 0402 Chip Resistor - Surface Mount ROHS","Yageo","RC0402FR-0747KL",null,null,"R136, R137, R146, R150, R207, R212, R214, R219, R222, R223, R243, R245, R252, R258",14,1000,{"$f":"J87*K87","v":14000},"pcs","SMD",null,{"$f":"VLOOKUP(F87,'[1]RV1106 board'!$F$7:$P$143,11,0)","v":"0.0009"},{"$f":"P87*L87","v":12.6},{"$f":"VLOOKUP(F87,'[1]RV1106 board'!$F$7:$R$143,13,0)","v":"LCSC"},{"$nulls":5},"R27,R2"]
[82,null,"Resistor","50V Thick Film Resistors 62.5mW 22Ω ±1% ±100ppm/℃ 0402 Chip Resistor - Surface Mount ROHS","Yageo","RC0402FR-0722RL",null,null,"R41, R43, R47, R48, R60, R62, R69, R106, R107, R108, R109, R110, R124",13,1000,{"$f":"J88*K88","v":13000},"pcs","SMD",null,{"$f":"VLOOKUP(F88,'[1]RV1106 board'!$F$7:$P$143,11,0)","v":"0.0009"},{"$f":"P88*L88","v":11.7},{"$f":"VLOOKUP(F88,'[1]RV1106 board'!$F$7:$R$143,13,0)","v":"LCSC"},{"$nulls":5},1]
[83,null,"Capacitor","2.2uF ±10% 6.3V X5R 0603 Multilayer Ceramic Capacitors MLCC - SMD/SMT RoHS","\tSamsung Electro-Mechanics","CL10A225KQ8NNNC",null,null,"C4, C154",2,1000,{"$f":"J89*K89","v":2000},"pcs","SMD",null,{"$f":"VLOOKUP(F89,'[1]RV1106 board'!$F$7:$P$143,11,0)","v":4.7999999999999996E-3},{"$f":"P89*L89","v":9.6},{"$f":"VLOOKUP(F89,'[1]RV1106 board'!$F$7:$R$143,13,0)","v":"LCSC"},{"$nulls":5},1]
[84,null,"Capacitor","50V 470nF X7R ±10% 0603 Multilayer Ceramic Capacitors MLCC - SMD/SMT ROHS","Yageo","CC0603KRX7R9BB474",null,null,"C23",1,1000,{"$f":"J90*K90","v":1000},"pcs","SMD",null,{"$f":"VLOOKUP(F90,'[1]RV1106 board'!$F$7:$P$143,11,0)","v":8.2000000000000007E-3},{"$f":"P90*L90","v":8.2000000000000011},{"$f":"VLOOKUP(F90,'[1]RV1106 board'!$F$7:$R$143,13,0)","v":"LCSC"},{"$nulls":5},"R5,R10"]
[85,null,"LED","20mA 225mcd Colorless Transparent Lens -20℃~+85℃ Positive Stick 620nm~630nm Red 120° 50mW 2.3V 0603 LED Indication - Discrete ROH","XINGLIGHT","XL-1608SURC-06",null,null,"D22, D33",2,1000,{"$f":"J91*K91","v":2000},"pcs","SMD",null,{"$f":"VLOOKUP(F91,'[1]RV1106 board'!$F$7:$P$143,11,0)","v":"0.0038"},{"$f":"P91*L91","v":7.6},{"$f":"VLOOKUP(F91,'[1]RV1106 board'!$F$7:$R$143,13,0)","v":"LCSC"},{"$nulls":5},"R13, r16,R25,R18,R250,R33,R257,R6,R34,R35,R164,R165,R17,R49,"]
[86,null,"Capacitor","CAP CER 22UF 6.3V X5R 0603","Samsung Electro-Mechanics","CL10A226MQ8NRNE",null,null,"C53",1,1000,{"$f":"J92*K92","v":1000},"pcs","SMD",null,{"$f":"VLOOKUP(F92,'[1]RV1106 board'!$F$7:$P$143,11,0)","v":7.3000000000000001E-3},{"$f":"P92*L92","v":7.3},{"$f":"VLOOKUP(F92,'[1]RV1106 board'!$F$7:$R$143,13,0)","v":"LCSC"},{"$nulls":5},1]
[87,null,"Resistor","62.5mW Thick Film Resistor 50V ±100ppm/℃ ±1% 100kΩ 0402 Chip Resistor - Surface Mount ROHS","Yageo","RC0402FR-07100KL",null,null,"R2, R27, R40, R44, R46, R114, R238, R240, R242",9,1000,{"$f":"J93*K93","v":9000},"pcs","SMD",null,{"$f":"VLOOKUP(F93,'[1]RV1106 board'!$F$7:$P$143,11,0)","v":"0.0008"},{"$f":"P93*L93","v":7.2},{"$f":"VLOOKUP(F93,'[1]RV1106 board'!$F$7:$R$143,13,0)","v":"LCSC"},{"$nulls":5},1]
[88,null,"Connector","XH Header Male Pin 0.098\"(2.50mm) 2 Through Hole Wire To Board / Wire To Wire Connector RoHS"," \tBOOMELE(Boom Precision Elec)","XH-2A",null,null,"J26",1,1000,{"$f":"J94*K94","v":1000},"pcs","TH",null,{"$f":"VLOOKUP(F94,'[1]RV1106 board'!$F$7:$P$143,11,0)","v":"0.0070"},{"$f":"P94*L94","v":7},{"$f":"VLOOKUP(F94,'[1]RV1106 board'!$F$7:$R$143,13,0)","v":"LCSC"},{"$nulls":5},"R256,R9,R53,R78,R83,R86,R90,R102,R94,R95,249,111,112,233,263,149,156,188,196,204,R190,189"]
[89,null,"Resistor","62.5mW 2.2Ω 50V Thick Film Resistor ±1% ±200ppm/℃ 0402 Chip Resistor - Surface Mount RoHS","YAGEO","YAGEO RC0402FR-072R2L",null,null,"R122, R123, R125, R126",4,1000,{"$f":"J95*K95","v":4000},"pcs","SMD",null,{"$f":"VLOOKUP(F95,'[1]RV1106 board'!$F$7:$P$143,11,0)","v":"0.0017"},{"$f":"P95*L95","v":6.8},{"$f":"VLOOKUP(F95,'[1]RV1106 board'!$F$7:$R$143,13,0)","v":"LCSC"},{"$nulls":5},1]
[90,null,"LED","LED YELLOW CLEAR 0603 SMD","XINGLIGHT","XL-1608UYC-06","Wurth Electronics Inc,","150060YS75000","D31",1,1000,{"$f":"J96*K96","v":1000},"pcs","SMD",null,{"$f":"VLOOKUP(F96,'[1]RV1106 board'!$F$7:$P$143,11,0)","v":5.4999999999999997E-3},{"$f":"P96*L96","v":5.5},{"$f":"VLOOKUP(F96,'[1]RV1106 board'!$F$7:$R$143,13,0)","v":"LCSC"},{"$nulls":5},1]
[91,null,"Inductor","180mA 68nH ±5% 1.4Ω 0402 Fixed Inductors RoHS","FH","VHF100505HQ68NJT",null,null,"L9",1,1000,{"$f":"J97*K97","v":1000},"pcs","SMD",null,{"$f":"VLOOKUP(F97,'[1]RV1106 board'!$F$7:$P$143,11,0)","v":"0.0051"},{"$f":"P97*L97","v":5.1000000000000005},{"$f":"VLOOKUP(F97,'[1]RV1106 board'!$F$7:$R$143,13,0)","v":"LCSC"},{"$nulls":5},1]
[92,null,"Capacitor","CAP CER 4.7UF 6.3V X5R 0603","AIDE CAPACITOR","C0603X5R475K6R3NT",null,null,"C196",1,1000,{"$f":"J98*K98","v":1000},"pcs","SMD",null,{"$f":"VLOOKUP(F98,'[1]RV1106 board'!$F$7:$P$143,11,0)","v":5.0000000000000001E-3},{"$f":"P98*L98","v":5},{"$f":"VLOOKUP(F98,'[1]RV1106 board'!$F$7:$R$143,13,0)","v":"LCSC"},{"$nulls":5},"R15"]
[93,null,"Inductor","700mA 47nH 160mΩ ±5% 0402 Fixed Inductors RoHS",null,"VHF100505HQ47NJT",null,null,"L8",1,1000,{"$f":"J99*K99","v":1000},"pcs","SMD",null,{"$f":"VLOOKUP(F99,'[1]RV1106 board'!$F$7:$P$143,11,0)","v":"0.0047"},{"$f":"P99*L99","v":4.7},{"$f":"VLOOKUP(F99,'[1]RV1106 board'!$F$7:$R$143,13,0)","v":"LCSC"},{"$nulls":5},1]
[94,null,"Capacitor","50V 10pF C0G ±5% 0805 Multilayer Ceramic Capacitors MLCC - SMD/SMT ROHS","CCTC","TCC0805COG100J500BT","PSA(Prosperity Dielectrics)","FN21N100J500PAG","C142",1,1000,{"$f":"J100*K100","v":1000},"pcs","SMD",null,{"$f":"VLOOKUP(F100,'[1]RV1106 board'!$F$7:$P$143,11,0)","v":3.5999999999999999E-3},{"$f":"P100*L100","v":3.6},{"$f":"VLOOKUP(F100,'[1]RV1106 board'!$F$7:$R$143,13,0)","v":"LCSC"},{"$nulls":5},1]
[95,null,"Resistor","62.5mW 118kΩ 50V Thick Film Resistor ±100ppm/℃ ±0.5% 0402 Chip Resistor - Surface Mount RoHS","Yageo","RC0402DR-07118KL",null,null,"R3",1,1000,{"$f":"J101*K101","v":1000},"pcs","SMD",null,{"$f":"VLOOKUP(F101,'[1]RV1106 board'!$F$7:$P$143,11,0)","v":"0.0036"},{"$f":"P101*L101","v":3.6},{"$f":"VLOOKUP(F101,'[1]RV1106 board'!$F$7:$R$143,13,0)","v":"LCSC"},{"$nulls":5},1]
[96,null,"Resistor","62.5mW Thick Film Resistor 50V ±100ppm/℃ ±1% 75Ω 0402 Chip Resistor - Surface Mount ROHS","Yageo","RC0402FR-0775RL",null,null,"R79, R84, R89, R93",4,1000,{"$f":"J102*K102","v":4000},"pcs","SMD",null,{"$f":"VLOOKUP(F102,'[1]RV1106 board'!$F$7:$P$143,11,0)","v":"0.0009"},{"$f":"P102*L102","v":3.6},{"$f":"VLOOKUP(F102,'[1]RV1106 board'!$F$7:$R$143,13,0)","v":"LCSC"},{"$nulls":5},1]
[97,null,"Resistor","RES 0 OHM 1206 JUMPER 1/4W SMD","YAGEO","RC1206JR-070RL",null,null,"R166",1,1000,{"$f":"J103*K103","v":1000},"pcs","SMD",null,{"$f":"VLOOKUP(F103,'[1]RV1106 board'!$F$7:$P$143,11,0)","v":3.5000000000000001E-3},{"$f":"P103*L103","v":3.5},{"$f":"VLOOKUP(F103,'[1]RV1106 board'!$F$7:$R$143,13,0)","v":"LCSC"},{"$nulls":5},1]
[98,null,"Resistor","RES SMD 0 OHM JUMPER 1/10W 0603","YAGEO","RC0603JR-070RL",null,null,"R30, R121, R168",3,1000,{"$f":"J104*K104","v":3000},"pcs","SMD",null,{"$f":"VLOOKUP(F104,'[1]RV1106 board'!$F$7:$P$143,11,0)","v":1.1000000000000001E-3},{"$f":"P104*L104","v":3.3000000000000003},{"$f":"VLOOKUP(F104,'[1]RV1106 board'!$F$7:$R$143,13,0)","v":"LCSC"},{"$nulls":5},"R24"]
[99,null,"Resistor","62.5mW Thick Film Resistor 50V ±100ppm/℃ ±1% 100Ω 0402 Chip Resistor - Surface Mount ROHS","Yageo","RC0402FR-07100RL",null,null,"R15, R104, R105, R152",4,1000,{"$f":"J105*K105","v":4000},"pcs","SMD",null,{"$f":"VLOOKUP(F105,'[1]RV1106 board'!$F$7:$P$143,11,0)","v":"0.0008"},{"$f":"P105*L105","v":3.2},{"$f":"VLOOKUP(F105,'[1]RV1106 board'!$F$7:$R$143,13,0)","v":"LCSC"},{"$nulls":5},"R26"]
[100,null,"Resistor","RES SMD 1 OHM 1% 1/10W 0603","YAGEO","RC0603FR-071RL",null,null,"R1",1,1000,{"$f":"J106*K106","v":1000},"pcs","SMD",null,{"$f":"VLOOKUP(F106,'[1]RV1106 board'!$F$7:$P$143,11,0)","v":3.0000000000000001E-3},{"$f":"P106*L106","v":3},{"$f":"VLOOKUP(F106,'[1]RV1106 board'!$F$7:$R$143,13,0)","v":"LCSC"}]
[101,null,"Resistor","RES SMD 10K OHM 1% 1/10W 0603","Yageo, Hottech","RC0603FR-0710KL, RI0603L1002FT",null,null,"R24, R235",2,1000,{"$f":"J107*K107","v":2000},"pcs","SMD",null,{"$f":"VLOOKUP(F107,'[1]RV1106 board'!$F$7:$P$143,11,0)","v":"0.0015"},{"$f":"P107*L107","v":3},{"$f":"VLOOKUP(F107,'[1]RV1106 board'!$F$7:$R$143,13,0)","v":"LCSC"}]
[102,null,"Capacitor","50V 56nF X7R ±10% 0603 Multilayer Ceramic Capacitors MLCC - SMD/SMT ROHS","Yageo","CC0603KRX7R9BB563",null,null,"C27",1,1000,{"$f":"J108*K108","v":1000},"pcs","SMD",null,{"$f":"VLOOKUP(F108,'[1]RV1106 board'!$F$7:$P$143,11,0)","v":2.7000000000000001E-3},{"$f":"P108*L108","v":2.7},{"$f":"VLOOKUP(F108,'[1]RV1106 board'!$F$7:$R$143,13,0)","v":"LCSC"},{"$nulls":5},"R255,R51,R52,R63,R72"]
[103,null,"Capacitor","50V 75pF NP0 ±5% 0603 Multilayer Ceramic Capacitors MLCC - SMD/SMT ROHS","Yageo","CC0603JRNPO9BN750",null,null,"C26",1,1000,{"$f":"J109*K109","v":1000},"pcs","SMD",null,{"$f":"VLOOKUP(F109,'[1]RV1106 board'!$F$7:$P$143,11,0)","v":2.5000000000000001E-3},{"$f":"P109*L109","v":2.5},{"$f":"VLOOKUP(F109,'[1]RV1106 board'!$F$7:$R$143,13,0)","v":"LCSC"},{"$nulls":5},"R254, R251,64,73,37,38,45,103,97,260,96,80,134,135,144,244,141,148,206,211,213,218,220,221"]
[104,null,"Capacitor","22pF ±5% 50V Ceramic Capacitor NP0 0402","Yageo","CC0402JRNPO9BN220",null,null,"C17, C29,C37",3,1000,{"$f":"J110*K110","v":3000},"pcs","SMD",null,{"$f":"VLOOKUP(F110,'[1]RV1106 board'!$F$7:$P$143,11,0)","v":8.0000000000000004E-4},{"$f":"P110*L110","v":2.4},{"$f":"VLOOKUP(F110,'[1]RV1106 board'!$F$7:$R$143,13,0)","v":"LCSC"},{"$nulls":5},"R47,R48,R41,R43"]
[105,null,"Capacitor","560 pF ±10% 50V Ceramic Capacitor X7R 0603 (1608 Metric)","Yageo","CC0603KRX7R9BB561",null,null,"C24",1,1000,{"$f":"J111*K111","v":1000},"pcs","SMD",null,{"$f":"VLOOKUP(F111,'[1]RV1106 board'!$F$7:$P$143,11,0)","v":2.2000000000000001E-3},{"$f":"P111*L111","v":2.2000000000000002},{"$f":"VLOOKUP(F111,'[1]RV1106 board'!$F$7:$R$143,13,0)","v":"LCSC"}]
[106,null,"Capacitor","CAP CER 100PF 50V X7R 0603","YAGEO","CC0603KRX7R9BB101",null,null,"C39",1,1000,{"$f":"J112*K112","v":1000},"pcs","SMD",null,{"$f":"VLOOKUP(F112,'[1]RV1106 board'!$F$7:$P$143,11,0)","v":2.2000000000000001E-3},{"$f":"P112*L112","v":2.2000000000000002},{"$f":"VLOOKUP(F112,'[1]RV1106 board'!$F$7:$R$143,13,0)","v":"LCSC"}]
[107,null,"Capacitor","CAP CER 0.1UF 50V X7R 0603","AIDE CAPACITOR","C0603X7R104K500NT",null,null,"C165",1,1000,{"$f":"J113*K113","v":1000},"pcs","SMD",null,{"$f":"VLOOKUP(F113,'[1]RV1106 board'!$F$7:$P$143,11,0)","v":1.9E-3},{"$f":"P113*L113","v":1.9},{"$f":"VLOOKUP(F113,'[1]RV1106 board'!$F$7:$R$143,13,0)","v":"LCSC"}]
[108,null,"Resistor","62.5mW 499kΩ 50V Thick Film Resistor ±100ppm/℃ ±1% 0402 Chip Resistor - Surface Mount RoHS","Yageo","RC0402FR-07499KL",null,null,"R26, R241",2,1000,{"$f":"J114*K114","v":2000},"pcs","SMD",null,{"$f":"VLOOKUP(F114,'[1]RV1106 board'!$F$7:$P$143,11,0)","v":"0.0009"},{"$f":"P114*L114","v":1.8},{"$f":"VLOOKUP(F114,'[1]RV1106 board'!$F$7:$R$143,13,0)","v":"LCSC"}]
[109,null,"Resistor","62.5mW Thick Film Resistor 50V ±100ppm/℃ ±1% 15kΩ 0402 Chip Resistor - Surface Mount ROHS","Yageo","RC0402FR-0715KL",null,null,"R50, R139",2,1000,{"$f":"J115*K115","v":2000},"pcs","SMD",null,{"$f":"VLOOKUP(F115,'[1]RV1106 board'!$F$7:$P$143,11,0)","v":"0.0009"},{"$f":"P115*L115","v":1.8},{"$f":"VLOOKUP(F115,'[1]RV1106 board'!$F$7:$R$143,13,0)","v":"LCSC"},{"$nulls":5},"R74,R75,R246,R247"]
[110,null,"Resistor","62.5mW 4.02Ω 50V Thick Film Resistor ±1% ±200ppm/℃ 0402 Chip Resistor - Surface Mount RoHS","Yageo","RC0402FR-074R02L",null,null,"R54",1,1000,{"$f":"J116*K116","v":1000},"pcs","SMD",null,{"$f":"VLOOKUP(F116,'[1]RV1106 board'!$F$7:$P$143,11,0)","v":"0.0017"},{"$f":"P116*L116","v":1.7},{"$f":"VLOOKUP(F116,'[1]RV1106 board'!$F$7:$R$143,13,0)","v":"LCSC"},{"$nulls":5},"77,82,87,91,81,85,88,92,253,151"]
[111,null,"Resistor","RES 1.1kΩ ±1% 62.5mW 0402","UNI-ROYAL","0402WGF1101TCE",null,null,"R5, R10",2,1000,{"$f":"J117*K117","v":2000},"pcs","SMD",null,{"$f":"VLOOKUP(F117,'[1]RV1106 board'!$F$7:$P$143,11,0)","v":"0.0007"},{"$f":"P117*L117","v":1.4},{"$f":"VLOOKUP(F117,'[1]RV1106 board'!$F$7:$R$143,13,0)","v":"LCSC"}]
[112,null,"Resistor","62.5mW Thick Film Resistor 50V ±100ppm/℃ ±1% 590kΩ 0402 Chip Resistor - Surface Mount ROHS","Yageo","AC0402FR-07590KL",null,null,"R200",1,1000,{"$f":"J118*K118","v":1000},"pcs","SMD",null,{"$f":"VLOOKUP(F118,'[1]RV1106 board'!$F$7:$P$143,11,0)","v":"0.0012"},{"$f":"P118*L118","v":1.2},{"$f":"VLOOKUP(F118,'[1]RV1106 board'!$F$7:$R$143,13,0)","v":"LCSC"}]
[113,null,"Resistor","226kΩ 62.5mW 50V Thick Film Resistor ±100ppm/℃ ±1% 0402 Chip Resistor - Surface Mount RoHS","Yageo","AC0402FR-07226KL",null,null,"R237",1,1000,{"$f":"J119*K119","v":1000},"pcs","SMD",null,{"$f":"VLOOKUP(F119,'[1]RV1106 board'!$F$7:$P$143,11,0)","v":"0.0012"},{"$f":"P119*L119","v":1.2},{"$f":"VLOOKUP(F119,'[1]RV1106 board'!$F$7:$R$143,13,0)","v":"LCSC"}]
[114,null,"Capacitor","8.2nF ±10% 50V Ceramic Capacitor X7R 0402","Yageo","CC0402KRX7R9BB822",null,null,"C14",1,1000,{"$f":"J120*K120","v":1000},"pcs","SMD",null,{"$f":"VLOOKUP(F120,'[1]RV1106 board'!$F$7:$P$143,11,0)","v":1.1000000000000001E-3},{"$f":"P120*L120","v":1.1000000000000001},{"$f":"VLOOKUP(F120,'[1]RV1106 board'!$F$7:$R$143,13,0)","v":"LCSC"},{"$nulls":5},"R252"]
[115,null,"Resistor","100mW 0Ω 75V Thick Film Resistor ±5% 0603 Chip Resistor - Surface Mount RoHS","Yageo","RC0603JR-070RL",null,null,"R28",1,1000,{"$f":"J121*K121","v":1000},"pcs","SMD",null,{"$f":"VLOOKUP(F121,'[1]RV1106 board'!$F$7:$P$143,11,0)","v":1.1000000000000001E-3},{"$f":"P121*L121","v":1.1000000000000001},{"$f":"VLOOKUP(F121,'[1]RV1106 board'!$F$7:$R$143,13,0)","v":"LCSC"},{"$nulls":5},1]
[116,null,"Resistor","52.3kΩ ±1% 62.5mW 0402 Thick Film Resistor","Yageo","RC0402FR-0745K3L",null,null,"R12",1,1000,{"$f":"J122*K122","v":1000},"pcs","SMD",null,{"$f":"VLOOKUP(F122,'[1]RV1106 board'!$F$7:$P$143,11,0)","v":"0.0010"},{"$f":"P122*L122","v":1},{"$f":"VLOOKUP(F122,'[1]RV1106 board'!$F$7:$R$143,13,0)","v":"LCSC"}]
[117,null,"Resistor","45.3kΩ ±1% 62.5mW 0402 Thick Film Resistor","Yageo","RC0402FR-0745K3L",null,null,"R23",1,1000,{"$f":"J123*K123","v":1000},"pcs","SMD",null,{"$f":"VLOOKUP(F123,'[1]RV1106 board'!$F$7:$P$143,11,0)","v":"0.0010"},{"$f":"P123*L123","v":1},{"$f":"VLOOKUP(F123,'[1]RV1106 board'!$F$7:$R$143,13,0)","v":"LCSC"}]
[118,null,"Resistor","62.5mW Thick Film Resistor 50V ±100ppm/℃ ±1% 20kΩ 0402 Chip Resistor - Surface Mount ROHS","Yageo","RC0402FR-0720KL",null,null,"R171",1,1000,{"$f":"J124*K124","v":1000},"pcs","SMD",null,{"$f":"VLOOKUP(F124,'[1]RV1106 board'!$F$7:$P$143,11,0)","v":"0.0010"},{"$f":"P124*L124","v":1},{"$f":"VLOOKUP(F124,'[1]RV1106 board'!$F$7:$R$143,13,0)","v":"LCSC"}]
[119,null,"Resistor","62.5mW Thick Film Resistor 50V ±100ppm/℃ ±1% 68kΩ 0402 Chip Resistor - Surface Mount ROHS","Yageo","RC0402FR-0768KL",null,null,"R4",1,1000,{"$f":"J125*K125","v":1000},"pcs","SMD",null,{"$f":"VLOOKUP(F125,'[1]RV1106 board'!$F$7:$P$143,11,0)","v":"0.0009"},{"$f":"P125*L125","v":0.9},{"$f":"VLOOKUP(F125,'[1]RV1106 board'!$F$7:$R$143,13,0)","v":"LCSC"}]
[120,null,"Resistor","51.1kΩ 62.5mW 50V Thick Film Resistor ±100ppm/℃ ±1% 0402 Chip Resistor - Surface Mount RoHS","Yageo","RC0402FR-0751K1L",null,null,"R7",1,1000,{"$f":"J126*K126","v":1000},"pcs","SMD",null,{"$f":"VLOOKUP(F126,'[1]RV1106 board'!$F$7:$P$143,11,0)","v":"0.0009"},{"$f":"P126*L126","v":0.9},{"$f":"VLOOKUP(F126,'[1]RV1106 board'!$F$7:$R$143,13,0)","v":"LCSC"}]
[121,null,"Resistor","12kΩ 62.5mW 50V Thick Film Resistor ±100ppm/℃ ±1% 0402 Chip Resistor - Surface Mount RoHS","Yageo","RC0402FR-0712KL",null,null,"R8",1,1000,{"$f":"J127*K127","v":1000},"pcs","SMD",null,{"$f":"VLOOKUP(F127,'[1]RV1106 board'!$F$7:$P$143,11,0)","v":"0.0009"},{"$f":"P127*L127","v":0.9},{"$f":"VLOOKUP(F127,'[1]RV1106 board'!$F$7:$R$143,13,0)","v":"LCSC"}]
[122,null,"Resistor","62.5mW Thick Film Resistor 50V ±100ppm/℃ ±1% 1.91kΩ 0402 Chip Resistor - Surface Mount ROHS","Yageo","RC0402FR-071K91L",null,null,"R20",1,1000,{"$f":"J128*K128","v":1000},"pcs","SMD",null,{"$f":"VLOOKUP(F128,'[1]RV1106 board'!$F$7:$P$143,11,0)","v":"0.0009"},{"$f":"P128*L128","v":0.9},{"$f":"VLOOKUP(F128,'[1]RV1106 board'!$F$7:$R$143,13,0)","v":"LCSC"},{"$nulls":5},1]
[123,null,"Resistor","62.5mW 1MΩ 50V Thick Film Resistor ±100ppm/℃ ±1% 0402 Chip Resistor - Surface Mount RoHS","Yageo","RC0402FR-071ML",null,null,"R42",1,1000,{"$f":"J129*K129","v":1000},"pcs","SMD",null,{"$f":"VLOOKUP(F129,'[1]RV1106 board'!$F$7:$P$143,11,0)","v":"0.0009"},{"$f":"P129*L129","v":0.9},{"$f":"VLOOKUP(F129,'[1]RV1106 board'!$F$7:$R$143,13,0)","v":"LCSC"}]
[124,null,"Resistor","1.2kΩ ±1% 62.5mW 0402 Thick Film Resistor","Yageo","RC0402FR-071K2L",null,null,"R55",1,1000,{"$f":"J130*K130","v":1000},"pcs","SMD",null,{"$f":"VLOOKUP(F130,'[1]RV1106 board'!$F$7:$P$143,11,0)","v":"0.0009"},{"$f":"P130*L130","v":0.9},{"$f":"VLOOKUP(F130,'[1]RV1106 board'!$F$7:$R$143,13,0)","v":"LCSC"},{"$nulls":5},"Q4,Q41,Q12,Q34,Q16,Q17, Q39, Q19,Q38,Q37,Q21,Q23,Q26,Q27,Q24,Q25,Q28,Q29,Q30,Q31,Q32,Q33"]
[125,null,"Resistor","220Ω 62.5mW 50V Thick Film Resistor ±100ppm/℃ ±1% 0402 Chip Resistor - Surface Mount RoHS","Yageo","RC0402FR-07220RL",null,null,"R101",1,1000,{"$f":"J131*K131","v":1000},"pcs","SMD",null,{"$f":"VLOOKUP(F131,'[1]RV1106 board'!$F$7:$P$143,11,0)","v":"0.0009"},{"$f":"P131*L131","v":0.9},{"$f":"VLOOKUP(F131,'[1]RV1106 board'!$F$7:$R$143,13,0)","v":"LCSC"},{"$nulls":5},1]
[126,null,"Resistor","62.5mW Thick Film Resistor 50V ±100ppm/℃ ±1% 470Ω 0402 Chip Resistor - Surface Mount ROHS","Yageo","RC0402FR-07470RL",null,null,"R163",1,1000,{"$f":"J132*K132","v":1000},"pcs","SMD",null,{"$f":"VLOOKUP(F132,'[1]RV1106 board'!$F$7:$P$143,11,0)","v":"0.0009"},{"$f":"P132*L132","v":0.9},{"$f":"VLOOKUP(F132,'[1]RV1106 board'!$F$7:$R$143,13,0)","v":"LCSC"},{"$nulls":5},1]
[127,null,"Resistor","62.5mW Thick Film Resistor 50V ±100ppm/℃ ±1% 3.3kΩ 0402 Chip Resistor - Surface Mount ROHS","Yageo","RC0402FR-073K3L",null,null,"R203",1,1000,{"$f":"J133*K133","v":1000},"pcs","SMD",null,{"$f":"VLOOKUP(F133,'[1]RV1106 board'!$F$7:$P$143,11,0)","v":"0.0009"},{"$f":"P133*L133","v":0.9},{"$f":"VLOOKUP(F133,'[1]RV1106 board'!$F$7:$R$143,13,0)","v":"LCSC"},{"$nulls":5},"J14, J15, J16"]
[128,null,"Resistor","62.5mW Thick Film Resistor 50V ±100ppm/℃ ±1% 105kΩ 0402 Chip Resistor - Surface Mount ROHS","Yageo","RC0402FR-07105KL",null,null,"R11",1,1000,{"$f":"J134*K134","v":1000},"pcs","SMD",null,{"$f":"VLOOKUP(F134,'[1]RV1106 board'!$F$7:$P$143,11,0)","v":"0.0008"},{"$f":"P134*L134","v":0.8},{"$f":"VLOOKUP(F134,'[1]RV1106 board'!$F$7:$R$143,13,0)","v":"LCSC"},{"$nulls":5},1]
[129,null,"Resistor","62.5mW Thick Film Resistor 50V ±100ppm/℃ ±1% 34kΩ 0402 Chip Resistor - Surface Mount ROHS","Yageo","RC0402FR-0734KL",null,null,"R22",1,1000,{"$f":"J135*K135","v":1000},"pcs","SMD",null,{"$f":"VLOOKUP(F135,'[1]RV1106 board'!$F$7:$P$143,11,0)","v":"0.0008"},{"$f":"P135*L135","v":0.8},{"$f":"VLOOKUP(F135,'[1]RV1106 board'!$F$7:$R$143,13,0)","v":"LCSC"},{"$nulls":5},1]
[130,null,"Resistor","8.45kΩ ±1% 62.5mW 0402 Thick Film Resistor","Yageo","RC0402FR-078K45L",null,null,"R29",1,1000,{"$f":"J136*K136","v":1000},"pcs","SMD",null,{"$f":"VLOOKUP(F136,'[1]RV1106 board'!$F$7:$P$143,11,0)","v":"0.0008"},{"$f":"P136*L136","v":0.8},{"$f":"VLOOKUP(F136,'[1]RV1106 board'!$F$7:$R$143,13,0)","v":"LCSC"},{"$nulls":5},1]
[131,null,"Resistor","57kΩ 62.5mW 50V Thick Film Resistor ±100ppm/℃ ±1% 0402 Chip Resistor - Surface Mount RoHS","Yageo","RC0402FR-07357KL",null,null,"R239",1,1000,{"$f":"J137*K137","v":1000},"pcs","SMD",null,{"$f":"VLOOKUP(F137,'[1]RV1106 board'!$F$7:$P$143,11,0)","v":"0.0008"},{"$f":"P137*L137","v":0.8},{"$f":"VLOOKUP(F137,'[1]RV1106 board'!$F$7:$R$143,13,0)","v":"LCSC"}]
[132,null,"Capacitor","680pF ±10% 50V Ceramic Capacitor X7R 0402","FOJAN, SAMWHA","FCC0402B681K500AT",null,null,"C11",1,1000,{"$f":"J138*K138","v":1000},"pcs","SMD",null,{"$f":"VLOOKUP(F138,'[1]RV1106 board'!$F$7:$P$143,11,0)","v":6.9999999999999999E-4},{"$f":"P138*L138","v":0.7},{"$f":"VLOOKUP(F138,'[1]RV1106 board'!$F$7:$R$143,13,0)","v":"LCSC"}]
[133,null,"Resistor","62.5mW Thick Film Resistor 50V ±100ppm/℃ ±1% 84.5kΩ 0402 Chip Resistor - Surface Mount ROHS","Yageo","RC0402FR-0784K5L",null,null,"R14",1,1000,{"$f":"J139*K139","v":1000},"pcs","SMD",null,{"$f":"VLOOKUP(F139,'[1]RV1106 board'!$F$7:$P$143,11,0)","v":"0.0006"},{"$f":"P139*L139","v":0.6},{"$f":"VLOOKUP(F139,'[1]RV1106 board'!$F$7:$R$143,13,0)","v":"LCSC"},{"$nulls":5},1]
[134,null,"Resistor","62.5mW Thick Film Resistor 50V ±100ppm/℃ ±1% 21.5kΩ 0402 Chip Resistor - Surface Mount ROHS","Yageo","RC0402FR-0721K5L",null,null,"R19",1,1000,{"$f":"J140*K140","v":1000},"pcs","SMD",null,{"$f":"VLOOKUP(F140,'[1]RV1106 board'!$F$7:$P$143,11,0)","v":"0.0006"},{"$f":"P140*L140","v":0.6},{"$f":"VLOOKUP(F140,'[1]RV1106 board'!$F$7:$R$143,13,0)","v":"LCSC"}]
[135,null,"Stencil","Stencil for Cambox RV1106",{"$nulls":5},1,1,{"$f":"J141*K141","v":1},"pcs","ASM",null,80,{"$f":"P141*L141","v":80}]
[{"$nulls":4},"TOTAL (USD):",{"$nulls":11},{"$f":"SUM(Q7:Q141)","v":47939.099999999977}]
[{"$nulls":4},"EXW Price / Board (USD):",{"$nulls":11},{"$f":"Q142/1000","v":47.939099999999975}]
[{"$nulls":4},"EXW Price / Board (VND):"]

{"sheet":"GX Board","index":1,"n_rows":21,"n_cols":19,"rows_kept":21,"cut":false,"hidden":false,"merged":[[20,4,20,15],[4,4,4,5],[4,6,4,7],[18,4,18,15],[19,4,19,15],[3,0,3,1],[3,9,3,14],[1,17,1,18],[2,17,2,18],[0,0,1,2],[0,3,0,8],[0,9,0,13],[1,3,1,8],[1,9,1,13],[2,0,2,1],[2,9,2,14]]}
[null,null,null,{"$f":"UPPER(\"Bill of Materials\")","v":"BILL OF MATERIALS"},{"$nulls":5},"Rev:"]
[null,null,null,"Camera_box_gx",{"$nulls":5},"Production QTY",{"$nulls":7},"BOM Export Date: 04/05/26 16:31:42"]
["Customer:",null,"Aithings","HW version:","5.0",null,"Checked by:",null,null,"Date created:",{"$nulls":7},"Website：https://www,lcsc,com/bom"]
["Board code:",null,"Camera_box_gx","Prepared by:","Ducdv",null,"Approved by:",null,null,"26/03/2026"]
[{"$nulls":4},"Mã Hàng Hóa Ưu Tiên Mua",null,"Mã Hàng Hóa Tham Khảo"]
["STT","Internal Code","Category","Description","Manufacturer","Partnumber","Manufacturer 2","Manufacturer's Part Number 2","Designator","QTY / Set","Production quantity","Total Quantity","Unit","Mounting type","Note","EXW Price\n(USD)","Total EXW Price\n(USD)","Supplier","Việc cần làm"]
[{"$f":"ROW(A7)-ROW($A$6)","v":1},null,"Capacitor","CAP CER 1UF 50V X5R 0603","FH","0603X105M500NT","Samsung Electro-Mechanics","CL10A105KB8NNNC","C1, C2, C3, C4",4,1000,{"$f":"J7*K7","v":4000},null,"SMD",null,{"$f":"VLOOKUP(F7,'[1]GX Board'!$F$7:$P$18,11,0)","v":4.5999999999999999E-3},{"$f":"P7*L7","v":18.399999999999999},"LCSC"]
[{"$f":"ROW(A8)-ROW($A$6)","v":2},null,"Connector","2x2P 4P Micro-Fit(MX 3,0) 3mm 2 2 3mm Direct Insert Plugin,P=3mm Wire To Board Connector ROHS","BOOMELE(Boom Precision Elec)","3.0-2*2A",null,null,"J7, J9, J10, J11, J12, J13",6,1000,{"$f":"J8*K8","v":6000},null,"SMD",null,{"$f":"VLOOKUP(F8,'[1]GX Board'!$F$7:$P$18,11,0)","v":4.4499999999999998E-2},{"$f":"P8*L8","v":267},"LCSC"]
[{"$f":"ROW(A9)-ROW($A$6)","v":3},null,"Connector","2x6P 12P Gold Brass -40℃~+105℃ Pin Header Black 2mm 2mm 250V 3A 2 2mm SMD,P=2mm Headers, Male Pins ROHS","XKB Connection","X4621WRS-2x06I-C40D64","XKB Connection","X4621WRS-2x03I-C40D64","J8, J14, J15",3,1000,3000,null,"SMD",null,{"$f":"VLOOKUP(F9,'[1]GX Board'!$F$7:$P$18,11,0)","v":0.18559999999999999},{"$f":"P9*L9","v":556.79999999999995},"LCSC"]
[{"$f":"ROW(A10)-ROW($A$6)","v":4},null,"MOSFET","SOT-23-3 MOSFETs P-Chanel ROHS","TECH PUBLIC","SI2333CDS",null,null,"Q1, Q2, Q5, Q6",4,1000,4000,null,"SMD",null,{"$f":"VLOOKUP(F10,'[1]GX Board'!$F$7:$P$18,11,0)","v":5.8000000000000003E-2},{"$f":"P10*L10","v":232},"LCSC"]
[{"$f":"ROW(A11)-ROW($A$6)","v":5},null,"Resistor","62,5mW Thick Film Resistor 50V ±100ppm/℃ ±1% 10kΩ 0402 Chip Resistor - Surface Mount ROHS","FOJAN","FRC0402F1002TS","Yageo","RC0402FR-0710KL","R1, R2, R7, R8",4,1000,4000,null,"SMD",null,{"$f":"VLOOKUP(F11,'[1]GX Board'!$F$7:$P$18,11,0)","v":4.0000000000000002E-4},{"$f":"P11*L11","v":1.6},"LCSC"]
[{"$f":"ROW(A12)-ROW($A$6)","v":6},null,"Resistor","62,5mW Thick Film Resistors 50V ±100ppm/℃ ±1% 4,7kΩ 0402 Chip Resistor - Surface Mount ROHS","FOJAN","FRC0402F4701TS","Yageo","RC0402FR-074K7L","R3, R4, R9, R10",4,1000,4000,null,"SMD",null,{"$f":"VLOOKUP(F12,'[1]GX Board'!$F$7:$P$18,11,0)","v":4.0000000000000002E-4},{"$f":"P12*L12","v":1.6},"LCSC"]
[{"$f":"ROW(A13)-ROW($A$6)","v":7},null,"Resistor","62,5mW Thick Film Resistor 50V ±100ppm/℃ ±1% 47kΩ 0402 Chip Resistor - Surface Mount ROHS","FOJAN","FRC0402F4702TS","Yageo","RC0402FR-0747KL","R5, R6, R11, R12",4,1000,4000,null,"SMD",null,{"$f":"VLOOKUP(F13,'[1]GX Board'!$F$7:$P$18,11,0)","v":4.0000000000000002E-4},{"$f":"P13*L13","v":1.6},"LCSC"]
[{"$f":"ROW(A14)-ROW($A$6)","v":8},null,"Transistor","TRANS NPN 60V 0,5A SOT23","TECH PUBLIC","TPMMBTA05","ON Semiconductor","MMBTA05LT1G","Q3, Q4, Q7, Q8",4,1000,4000,null,"SMD",null,{"$f":"VLOOKUP(F14,'[1]GX Board'!$F$7:$P$18,11,0)","v":1.7000000000000001E-2},{"$f":"P14*L14","v":68},"LCSC"]
[{"$f":"ROW(A15)-ROW($A$6)","v":9},null,"Connector","Giắc GX12-2P 2 Chân (Đực)","chxunda","XD-GX12-2P-F","LKTC","GX12-2P","J1",1,1000,1000,null,"TH",null,{"$f":"VLOOKUP(F15,'[1]GX Board'!$F$7:$P$18,11,0)","v":0.37269999999999998},{"$f":"P15*L15","v":372.7},"LCSC"]
[{"$f":"ROW(A16)-ROW($A$6)","v":10},null,"Connector","Giắc GX12-4P 12mm 4 Chân (Đực)","chxunda","XD-GX12-4P-M","LKTC","GX12-4P","J2, J3, J5, J6",4,1000,4000,null,"TH",null,{"$f":"VLOOKUP(F16,'[1]GX Board'!$F$7:$P$18,11,0)","v":0.38964705882352901},{"$f":"P16*L16","v":1558.588235294116},"LCSC"]
[{"$f":"ROW(A17)-ROW($A$6)","v":11},null,"PCB","PCB, 2 layer, 113,94 mm* 23,58 mm, PCB Thickness: 1,6mm, Gerber_Camerabox-gx_2025-11-24_Y2413","JLC","Y2413",null,null,null,1,1000,1000,null,"ASM",null,{"$f":"VLOOKUP(F17,'[1]GX Board'!$F$7:$P$18,11,0)","v":0.3},{"$f":"P17*L17","v":300},"LCSC"]
[{"$f":"ROW(A18)-ROW($A$6)","v":12},null,"Stencil",{"$nulls":6},1,1,1,null,"ASM",null,80,{"$f":"P18*L18","v":80},"LCSC"]
[{"$nulls":4},"TOTAL (USD):",{"$nulls":11},{"$f":"SUM(Q7:Q18)","v":3458.2882352941156}]
[{"$nulls":4},"EXW Price / Board (USD):",{"$nulls":11},{"$f":"Q19/1000","v":3.4582882352941158}]
[{"$nulls":4},"EXW Price / Board (VND):"]

{"sheet":"Vat_tu_phu","index":2,"n_rows":16,"n_cols":20,"rows_kept":16,"cut":false,"hidden":false,"merged":[[1,15,1,18],[3,0,3,1],[3,9,3,14],[0,0,1,2],[0,3,0,8],[0,9,0,13],[1,3,1,8],[1,9,1,13],[2,0,2,1],[2,9,2,14]]}
[null,null,null,{"$f":"UPPER(\"Bill of Materials\")","v":"BILL OF MATERIALS"},{"$nulls":5},"Rev:"]
[null,null,null,"Camera_box_vật tư phụ",{"$nulls":5},"Production QTY",{"$nulls":5},"Nguồn khác"]
["Customer:",null,"Aithings","HW version:","5.0",null,"Checked by:",null,null,"Date created:"]
["Board code:",null,"Vật tư phụ","Prepared by:","Ducdv",null,"Approved by:",null,null,"26/03/2026"]
["STT","Internal Code","Category","Description","Manufacture","Partnumber","Manufacturer 2","Manufacturer's Part Number 2","Designator","Quantity/kit","Board","Total","Unit","Mounting type","Note","Order Qty.","Unit Price(VND)","Ext,Price(VND)","Nguồn"]
[{"$f":"ROW(A6)-ROW($A$5)","v":1},null,"Battery","Pin Lithium","Shoppe: AM Linh Kiện",{"$nulls":4},1,10,{"$f":"J6*K6","v":10},null,"ASM",null,10,50000,{"$f":"Q6*P6","v":500000},"https://shopee.vn/product/472471748/27209001295?gads_t_sig=gqRjZGVrxHCFomtpsTE0MjUxOnRzc19zZGtfa2V5omt20QABpGFsZ2_SAAAAZKNkZWvAomN0xEAAAAAMRoz0ZUjQw0QlRa--FjB0AKnHQPF7xv4DyGj9-GQwqn4zSdB6gztmw7ebmtsZs9FPJxlVqctc57WUE3IRqmNpcGhlcnRleHTEbgAAAAzOmWiKQhTD73oy3pMTD74YwXKLY4RmTmx_PECgQdqrSMko9Yj-LV50FldCrrJu5kPHupxjQruBx93-Rht53dteckDz3PQ9R9Ffxg1CnUg0Q4ADNZT7dVO_ek6XNMjV98hEJY0-rMFUz31c&gad_source=1&gad_campaignid=22506035722&gbraid=0AAAAADPpQE6U2mKiUDG5SpqIjApCVJLCa&gclid=Cj0KCQjwh-HPBhCIARIsAC0p3ccvrmVkDpuOBH77KWqu0VKbvpR57SbJKexkpAHzM0uqhK1QMQfLJz4aAmzGEALw_wcB"]
[2,null,"BOX","Vỏ hộp ","Kadotech","KDT-2526",null,null,null,1,10,10,null,"ASM",null,"-",null,"-","Chưa tìm được nguồn mua phù hợp"]
[3,null,"Connector","Cáp RF Đầu SMA Cái Nối 1,13Ipex Dài 10cm","TGIC","1,13Ipex",null,null,null,2,10,20,null,"ASM",null,20,11970,{"$f":"Q8*P8","v":239400},"https://www.thegioiic.com/cap-rf-dau-sma-cai-noi-1-13ipex-dai-10cm"]
[4,null,"Product","Miếng dẫn nhiệt thermal pad 5W/mK cho vga, chipset, ic dày 0,5, 1, 1,5, 2, 2,5, 3, 5mm ,kienstore358","Shopee\nkienstore358","100x100x2mm",null,null,null,1,5,5,null,"ASM","Tản nhiệt SOM",3,46500,{"$f":"Q9*P9","v":139500},"https://shopee.vn/product/16195091/3632842107?gads_t_sig=gqRjZGVrxHCFomtpsTE0MjUxOnRzc19zZGtfa2V5omt20QABpGFsZ2_SAAAAZKNkZWvAomN0xEAAAAAMRoz0ZUjQw0QlRa--FjB0AKnHQPF7xv4DyGj9-GQwqn4zSdB6gztmw7ebmtsZs9FPJxlVqctc57WUE3IRqmNpcGhlcnRleHTEagAAAAxLgiQivYZgW5foBPUBW12V8NHF09EY7qvmQOS38IA2e0CYjRekDsolqv8LMehX3QA7bJdvA0ZGP-sAncSvKGxwbMeXwQx2NGhEZXdYRNYdiWPk82HQPWPYfVW33Sbu0RV7orG3wGk&gad_source=1&gad_campaignid=22496000355&gbraid=0AAAAADPpQE6bBolz_JwwPGJCnXnPJllEZ&gclid=Cj0KCQjwh-HPBhCIARIsAC0p3ccJjJk5KYxemJ07EzcLDLZYWXACEOCjEViEVKBJMcyI0qedliT716YaAkxiEALw_wcB"]
[5,null,"Quạt","Quạt Tản Nhiệt Mini 2510 – Quạt 2.5cm 25x25x10mm 5V / 12V DC – Gió Mạnh, Nhỏ Gọn, Ít Tiếng Ồn","SHOPPE","Mini Eibbkg 5V",null,null,null,1,10,10,null,"ASM",null,10,35000,{"$f":"Q10*P10","v":350000},"https://shopee.vn/Qu%EF%BF%BD%E1%BA%A1t-T%E1%BA%A3n-Nhi%E1%BB%87t-Mini-2510-%E2%80%93-Qu%E1%BA%A1t-2.5cm-25x25x10mm-5V-12V-DC-%E2%80%93-Gi%C3%B3-M%E1%BA%A1nh-Nh%E1%BB%8F-G%E1%BB%8Dn-%C3%8Dt-Ti%E1%BA%BFng-%E1%BB%92n-i.983524123.51300841631?extraParams=%7B%22display_model_id%22%3A445075556373%2C%22model_selection_logic%22%3A3%7D"]
[6,null,"Screw","10 cái M3 M4 M5 Bulong lục giác chìm đầu bằng đen thép mạ cấp bền 10,9 M3 M4 M5","Shopee Khôi Fasten","M3x16mm",null,null,null,4,10,40,null,"ASM","Vít cho quạt",50,{"$f":"35000/50","v":700},{"$f":"Q11*P11","v":35000},"https://shopee.vn/50-c%C3%A1i-M3-M4-M5-Bulong-l%E1%BB%A5c-gi%C3%A1c-ch%C3%ACm-%C4%91%E1%BA%A7u-b%E1%BA%B1ng-%C4%91en-th%C3%A9p-m%E1%BA%A1-c%E1%BA%A5p-b%E1%BB%81n-10.9-i.39096692.12657476490"]
[7,null,"Screw","Set 50, 20 Tán Dẹp Ecu Inox 304, thép thôi, thép mạ Cho ốc M3, M4, M5, M6, M8 Set 10 con đai ốc inox loại tốt","Linh kiện điện tử SMD","M3 Inox304",null,null,null,4,10,40,null,"ASM","Bulong hàn cho quạt",50,1600,{"$f":"Q12*P12","v":80000},"https://shopee.vn/product/134796651/18762050701?gads_t_sig=gqRjZGVrxHCFomtpsTE0MjUxOnRzc19zZGtfa2V5omt20QABpGFsZ2_SAAAAZKNkZWvAomN0xEAAAAAMRoz0ZUjQw0QlRa--FjB0AKnHQPF7xv4DyGj9-GQwqn4zSdB6gztmw7ebmtsZs9FPJxlVqctc57WUE3IRqmNpcGhlcnRleHTEbgAAAAyjVrs0gr8UnuryeetI3FX5Y16AmL_mbFh-BhzhNYSPCYip1w6WS6FoDljuqhTt2G5b1K_wR9XnDLR9WZzE5wC81X4yviPtEfAPixm0EH_uhDsW8r7vXboffenME-Yw3AOA9ysYlFQUXDIh&gad_source=1&gad_campaignid=22496000355&gbraid=0AAAAADPpQE6bBolz_JwwPGJCnXnPJllEZ&gclid=Cj0KCQjwh-HPBhCIARIsAC0p3cfnu3W1ldu4Fhpn7GV8qDwtxFhI1ARvfrlSmeh8cJ9jHKLEj-Gj6C4aAurrEALw_wcB"]
[8,null,"Screw","M1,2 M1,4 M1,6 M2 M2,5 M3 M4 M5 M6 Thép Carbon Kẽm Đen CM Cross Phillips Siêu Mỏng Siêu Thấp Đầu Phẳng Vít Bu Lông","Shopee huiruixin,vn","M1,4x2,5mm",null,null,null,1,10,10,null,"ASM","Vít cho SOM",500,null,52000,"https://shopee.vn/M1.2-M1.4-M1.6-M2-M2.5-M3-M4-M5-M6-Th%C3%A9p-Carbon-K%E1%BA%BDm-%C4%90en-CM-Cross-Phillips-Si%C3%AAu-M%E1%BB%8Fng-Si%C3%AAu-Th%E1%BA%A5p-%C4%90%E1%BA%A7u-Ph%E1%BA%B3ng-V%C3%ADt-Bu-L%C3%B4ng-i.889466159.28555773016?extraParams=%7B%22display_model_id%22%3A246227873566%2C%22model_selection_logic%22%3A3%7D"]
[9,null,"Screw","Bộ 10 Long đen/ vòng đệm các kích thước.M1.6 M2 M2.5 M3 M4 M6 M8 M10 M12 M14","Linh kiện điện tử SMD","M3",null,null,null,4,10,40,null,"ASM","Vênh cho quạt",40,null,20000,"https://shopee.vn/product/51517981/5019789812?gads_t_sig=gqRjZGVrxHCFomtpsTE0MjUxOnRzc19zZGtfa2V5omt20QABpGFsZ2_SAAAAZKNkZWvAomN0xEAAAAAMRoz0ZUjQw0QlRa--FjB0AKnHQPF7xv4DyGj9-GQwqn4zSdB6gztmw7ebmtsZs9FPJxlVqctc57WUE3IRqmNpcGhlcnRleHTEagAAAAyUnapXmxqrtAARC2f2cAyv2rWo4S6nSmJarRu2hF963X_eLnWICFmDLSksVdDtVkHlcvDes5vsZPttikVHhlfJAtwmGUBR9F0tm60UZ4rTVfZJAH2dWM_Bkpq7YSLuwi3vIB1wnUw&gad_source=1&gad_campaignid=22651004374&gbraid=0AAAAADPpQE6hA2b-beNyuq8-eNHxmjDX-&gclid=Cj0KCQjwh-HPBhCIARIsAC0p3ceXFYtQJC6HCGelD_ac7vc2P3AYvNRl1mFwCvvVQZLvehYiAS0tv8saAhFLEALw_wcB"]
[10,null,"Connector","Giắc GX12-2P 2 Chân (Cái) Đấu Dây Test","LKTC","GX12-2P (Cái)",null,null,null,1,10,10,null,"ASM",null,10,6200,{"$f":"Q15*P15","v":62000},"https://www.thegioiic.com/gx12-2p-dau-noi-tron-cai-2-chan-thang-hang-3a-125v"]
[null,null,null,"TỔNG",{"$nulls":13},{"$f":" SUM(R6:R15)","v":1477900},null,"VND"]

{"sheet":"Chi phí","index":3,"n_rows":4,"n_cols":8,"rows_kept":4,"cut":false,"hidden":false,"merged":[[1,6,3,6]]}
["STT","Loại","Số lượng","Đơn giá","Đơn vị","Quy đổi(VND)","Tổng tiền (VND)","Ghi chú"]
[1,"RV1106 Board",1,{"$f":"RV1106_Board!#REF!","v":{"$error":"#REF!"}},"USD",{"$f":"D2*26337","v":{"$error":"#REF!"}},{"$f":"F2+F3+F4","v":{"$error":"#REF!"}}]
[2,"Vat_tu_phu",1,{"$f":"Vat_tu_phu!R16","v":1477900},"VND",{"$f":"D3","v":1477900}]
[3,"GX_Board",1,{"$f":"'GX Board'!$R$19","v":0},"USD",{"$f":"D4*26337","v":0}]